{"text_format":"3","workbook":"xlsx","n_sheets":3,"sheets":["CALENDARIO 2020","CALENDARIO 2021","CALENDARIO 2022"],"not_rendered":{"images":1,"defined_names":77},"read":"whole","date_system":"1900"}

{"sheet":"CALENDARIO 2020","index":0,"n_rows":49,"n_cols":16,"rows_kept":49,"merged":[[0,1,0,15],[1,1,1,7],[1,9,1,15],[9,1,9,7],[9,9,9,15],[17,1,17,7],[17,9,17,15],[25,1,25,7],[25,9,25,15],[33,1,33,7],[33,9,33,15],[41,1,41,7],[41,9,41,15]]}
[null,{"$f":"YEAR(TODAY())","v":2020}]
[null,{"$f":"UPPER(TEXT(Jan_Val,\"MMMM\"))","v":"GENNAIO"},{"$nulls":7},{"$f":"UPPER(TEXT(Feb_Val,\"MMMM\"))","v":"FEBBRAIO"}]
[null,{"$f":"CHOOSE(1+(WeekStart=\"Monday\"),\"Dom\",\"Lun\",\"Mar\",\"Mer\",\"Gio\",\"Ven\",\"Sab\",\"Dom\")","v":"Lun"},{"$f":"CHOOSE(2+(WeekStart=\"Monday\"),\"Dom\",\"Lun\",\"Mar\",\"Mer\",\"Gio\",\"Ven\",\"Sab\",\"Dom\")","v":"Mar"},{"$f":"CHOOSE(3+(WeekStart=\"Monday\"),\"Dom\",\"Lun\",\"Mar\",\"Mer\",\"Gio\",\"Ven\",\"Sab\",\"Dom\")","v":"Mer"},{"$f":"CHOOSE(4+(WeekStart=\"Monday\"),\"Dom\",\"Lun\",\"Mar\",\"Mer\",\"Gio\",\"Ven\",\"Sab\",\"Dom\")","v":"Gio"},{"$f":"CHOOSE(5+(WeekStart=\"Monday\"),\"Dom\",\"Lun\",\"Mar\",\"Mer\",\"Gio\",\"Ven\",\"Sab\",\"Dom\")","v":"Ven"},{"$f":"CHOOSE(6+(WeekStart=\"Monday\"),\"Dom\",\"Lun\",\"Mar\",\"Mer\",\"Gio\",\"Ven\",\"Sab\",\"Dom\")","v":"Sab"},{"$f":"CHOOSE(7+(WeekStart=\"Monday\"),\"Dom\",\"Lun\",\"Mar\",\"Mer\",\"Gio\",\"Ven\",\"Sab\",\"Dom\")","v":"Dom"},null,{"$f":"CHOOSE(1+(WeekStart=\"Monday\"),\"Dom\",\"Lun\",\"Mar\",\"Mer\",\"Gio\",\"Ven\",\"Sab\",\"Dom\")","v":"Lun"},{"$f":"CHOOSE(2+(WeekStart=\"Monday\"),\"Dom\",\"Lun\",\"Mar\",\"Mer\",\"Gio\",\"Ven\",\"Sab\",\"Dom\")","v":"Mar"},{"$f":"CHOOSE(3+(WeekStart=\"Monday\"),\"Dom\",\"Lun\",\"Mar\",\"Mer\",\"Gio\",\"Ven\",\"Sab\",\"Dom\")","v":"Mer"},{"$f":"CHOOSE(4+(WeekStart=\"Monday\"),\"Dom\",\"Lun\",\"Mar\",\"Mer\",\"Gio\",\"Ven\",\"Sab\",\"Dom\")","v":"Gio"},{"$f":"CHOOSE(5+(WeekStart=\"Monday\"),\"Dom\",\"Lun\",\"Mar\",\"Mer\",\"Gio\",\"Ven\",\"Sab\",\"Dom\")","v":"Ven"},{"$f":"CHOOSE(6+(WeekStart=\"Monday\"),\"Dom\",\"Lun\",\"Mar\",\"Mer\",\"Gio\",\"Ven\",\"Sab\",\"Dom\")","v":"Sab"},{"$f":"CHOOSE(7+(WeekStart=\"Monday\"),\"Dom\",\"Lun\",\"Mar\",\"Mer\",\"Gio\",\"Ven\",\"Sab\",\"Dom\")","v":"Dom"}]
[1,{"$f":"Days+DATE(CalYear,MONTH(Jan_Val),1)-WEEKDAY(DATE(CalYear,MONTH(Jan_Val),1),(WeekStart=\"Monday\")+1)+$A4*7-6","v":"2019-12-30"},"2019-12-31","2020-01-01","2020-01-02","2020-01-03","2020-01-04","2020-01-05",null,{"$f":"Days+DATE(CalYear,MONTH(Feb_Val),1)-WEEKDAY(DATE(CalYear,MONTH(Feb_Val),1),(WeekStart=\"Monday\")+1)+$A4*7-6","v":"2020-01-27"},"2020-01-28","2020-01-29","2020-01-30","2020-01-31","2020-02-01","2020-02-02"]
[2,{"$f":"Days+DATE(CalYear,MONTH(Jan_Val),1)-WEEKDAY(DATE(CalYear,MONTH(Jan_Val),1),(WeekStart=\"Monday\")+1)+$A5*7-6","v":"2020-01-06"},"2020-01-07","2020-01-08","2020-01-09","2020-01-10","2020-01-11","2020-01-12",null,{"$f":"Days+DATE(CalYear,MONTH(Feb_Val),1)-WEEKDAY(DATE(CalYear,MONTH(Feb_Val),1),(WeekStart=\"Monday\")+1)+$A5*7-6","v":"2020-02-03"},"2020-02-04","2020-02-05","2020-02-06","2020-02-07","2020-02-08","2020-02-09"]
[3,{"$f":"Days+DATE(CalYear,MONTH(Jan_Val),1)-WEEKDAY(DATE(CalYear,MONTH(Jan_Val),1),(WeekStart=\"Monday\")+1)+$A6*7-6","v":"2020-01-13"},"2020-01-14","2020-01-15","2020-01-16","2020-01-17","2020-01-18","2020-01-19",null,{"$f":"Days+DATE(CalYear,MONTH(Feb_Val),1)-WEEKDAY(DATE(CalYear,MONTH(Feb_Val),1),(WeekStart=\"Monday\")+1)+$A6*7-6","v":"2020-02-10"},"2020-02-11","2020-02-12","2020-02-13","2020-02-14","2020-02-15","2020-02-16"]
[4,{"$f":"Days+DATE(CalYear,MONTH(Jan_Val),1)-WEEKDAY(DATE(CalYear,MONTH(Jan_Val),1),(WeekStart=\"Monday\")+1)+$A7*7-6","v":"2020-01-20"},"2020-01-21","2020-01-22","2020-01-23","2020-01-24","2020-01-25","2020-01-26",null,{"$f":"Days+DATE(CalYear,MONTH(Feb_Val),1)-WEEKDAY(DATE(CalYear,MONTH(Feb_Val),1),(WeekStart=\"Monday\")+1)+$A7*7-6","v":"2020-02-17"},"2020-02-18","2020-02-19","2020-02-20","2020-02-21","2020-02-22","2020-02-23"]
[5,{"$f":"Days+DATE(CalYear,MONTH(Jan_Val),1)-WEEKDAY(DATE(CalYear,MONTH(Jan_Val),1),(WeekStart=\"Monday\")+1)+$A8*7-6","v":"2020-01-27"},"2020-01-28","2020-01-29","2020-01-30","2020-01-31","2020-02-01","2020-02-02",null,{"$f":"Days+DATE(CalYear,MONTH(Feb_Val),1)-WEEKDAY(DATE(CalYear,MONTH(Feb_Val),1),(WeekStart=\"Monday\")+1)+$A8*7-6","v":"2020-02-24"},"2020-02-25","2020-02-26","2020-02-27","2020-02-28","2020-02-29","2020-03-01"]
[6,{"$f":"Days+DATE(CalYear,MONTH(Jan_Val),1)-WEEKDAY(DATE(CalYear,MONTH(Jan_Val),1),(WeekStart=\"Monday\")+1)+$A9*7-6","v":"2020-02-03"},"2020-02-04","2020-02-05","2020-02-06","2020-02-07","2020-02-08","2020-02-09",null,{"$f":"Days+DATE(CalYear,MONTH(Feb_Val),1)-WEEKDAY(DATE(CalYear,MONTH(Feb_Val),1),(WeekStart=\"Monday\")+1)+$A9*7-6","v":"2020-03-02"},"2020-03-03","2020-03-04","2020-03-05","2020-03-06","2020-03-07","2020-03-08"]
[null,{"$f":"UPPER(TEXT(Mar_Val,\"MMMM\"))","v":"MARZO"},{"$nulls":7},{"$f":"UPPER(TEXT(Apl_Val,\"MMMM\"))","v":"APRILE"}]
[null,{"$f":"CHOOSE(1+(WeekStart=\"Monday\"),\"Dom\",\"Lun\",\"Mar\",\"Mer\",\"Gio\",\"Ven\",\"Sab\",\"Dom\")","v":"Lun"},{"$f":"CHOOSE(2+(WeekStart=\"Monday\"),\"Dom\",\"Lun\",\"Mar\",\"Mer\",\"Gio\",\"Ven\",\"Sab\",\"Dom\")","v":"Mar"},{"$f":"CHOOSE(3+(WeekStart=\"Monday\"),\"Dom\",\"Lun\",\"Mar\",\"Mer\",\"Gio\",\"Ven\",\"Sab\",\"Dom\")","v":"Mer"},{"$f":"CHOOSE(4+(WeekStart=\"Monday\"),\"Dom\",\"Lun\",\"Mar\",\"Mer\",\"Gio\",\"Ven\",\"Sab\",\"Dom\")","v":"Gio"},{"$f":"CHOOSE(5+(WeekStart=\"Monday\"),\"Dom\",\"Lun\",\"Mar\",\"Mer\",\"Gio\",\"Ven\",\"Sab\",\"Dom\")","v":"Ven"},{"$f":"CHOOSE(6+(WeekStart=\"Monday\"),\"Dom\",\"Lun\",\"Mar\",\"Mer\",\"Gio\",\"Ven\",\"Sab\",\"Dom\")","v":"Sab"},{"$f":"CHOOSE(7+(WeekStart=\"Monday\"),\"Dom\",\"Lun\",\"Mar\",\"Mer\",\"Gio\",\"Ven\",\"Sab\",\"Dom\")","v":"Dom"},null,{"$f":"CHOOSE(1+(WeekStart=\"Monday\"),\"Dom\",\"Lun\",\"Mar\",\"Mer\",\"Gio\",\"Ven\",\"Sab\",\"Dom\")","v":"Lun"},{"$f":"CHOOSE(2+(WeekStart=\"Monday\"),\"Dom\",\"Lun\",\"Mar\",\"Mer\",\"Gio\",\"Ven\",\"Sab\",\"Dom\")","v":"Mar"},{"$f":"CHOOSE(3+(WeekStart=\"Monday\"),\"Dom\",\"Lun\",\"Mar\",\"Mer\",\"Gio\",\"Ven\",\"Sab\",\"Dom\")","v":"Mer"},{"$f":"CHOOSE(4+(WeekStart=\"Monday\"),\"Dom\",\"Lun\",\"Mar\",\"Mer\",\"Gio\",\"Ven\",\"Sab\",\"Dom\")","v":"Gio"},{"$f":"CHOOSE(5+(WeekStart=\"Monday\"),\"Dom\",\"Lun\",\"Mar\",\"Mer\",\"Gio\",\"Ven\",\"Sab\",\"Dom\")","v":"Ven"},{"$f":"CHOOSE(6+(WeekStart=\"Monday\"),\"Dom\",\"Lun\",\"Mar\",\"Mer\",\"Gio\",\"Ven\",\"Sab\",\"Dom\")","v":"Sab"},{"$f":"CHOOSE(7+(WeekStart=\"Monday\"),\"Dom\",\"Lun\",\"Mar\",\"Mer\",\"Gio\",\"Ven\",\"Sab\",\"Dom\")","v":"Dom"}]
[null,{"$f":"Days+DATE(CalYear,MONTH(Mar_Val),1)-WEEKDAY(DATE(CalYear,MONTH(Mar_Val),1),(WeekStart=\"Monday\")+1)+$A4*7-6","v":"2020-02-24"},"2020-02-25","2020-02-26","2020-02-27","2020-02-28","2020-02-29","2020-03-01",null,{"$f":"Days+DATE(CalYear,MONTH(Apl_Val),1)-WEEKDAY(DATE(CalYear,MONTH(Apl_Val),1),(WeekStart=\"Monday\")+1)+$A4*7-6","v":"2020-03-30"},"2020-03-31","2020-04-01","2020-04-02","2020-04-03","2020-04-04","2020-04-05"]
[null,{"$f":"Days+DATE(CalYear,MONTH(Mar_Val),1)-WEEKDAY(DATE(CalYear,MONTH(Mar_Val),1),(WeekStart=\"Monday\")+1)+$A5*7-6","v":"2020-03-02"},"2020-03-03","2020-03-04","2020-03-05","2020-03-06","2020-03-07","2020-03-08",null,{"$f":"Days+DATE(CalYear,MONTH(Apl_Val),1)-WEEKDAY(DATE(CalYear,MONTH(Apl_Val),1),(WeekStart=\"Monday\")+1)+$A5*7-6","v":"2020-04-06"},"2020-04-07","2020-04-08","2020-04-09","2020-04-10","2020-04-11","2020-04-12"]
[null,{"$f":"Days+DATE(CalYear,MONTH(Mar_Val),1)-WEEKDAY(DATE(CalYear,MONTH(Mar_Val),1),(WeekStart=\"Monday\")+1)+$A6*7-6","v":"2020-03-09"},"2020-03-10","2020-03-11","2020-03-12","2020-03-13","2020-03-14","2020-03-15",null,{"$f":"Days+DATE(CalYear,MONTH(Apl_Val),1)-WEEKDAY(DATE(CalYear,MONTH(Apl_Val),1),(WeekStart=\"Monday\")+1)+$A6*7-6","v":"2020-04-13"},"2020-04-14","2020-04-15","2020-04-16","2020-04-17","2020-04-18","2020-04-19"]
[null,{"$f":"Days+DATE(CalYear,MONTH(Mar_Val),1)-WEEKDAY(DATE(CalYear,MONTH(Mar_Val),1),(WeekStart=\"Monday\")+1)+$A7*7-6","v":"2020-03-16"},"2020-03-17","2020-03-18","2020-03-19","2020-03-20","2020-03-21","2020-03-22",null,{"$f":"Days+DATE(CalYear,MONTH(Apl_Val),1)-WEEKDAY(DATE(CalYear,MONTH(Apl_Val),1),(WeekStart=\"Monday\")+1)+$A7*7-6","v":"2020-04-20"},"2020-04-21","2020-04-22","2020-04-23","2020-04-24","2020-04-25","2020-04-26"]
[null,{"$f":"Days+DATE(CalYear,MONTH(Mar_Val),1)-WEEKDAY(DATE(CalYear,MONTH(Mar_Val),1),(WeekStart=\"Monday\")+1)+$A8*7-6","v":"2020-03-23"},"2020-03-24","2020-03-25","2020-03-26","2020-03-27","2020-03-28","2020-03-29",null,{"$f":"Days+DATE(CalYear,MONTH(Apl_Val),1)-WEEKDAY(DATE(CalYear,MONTH(Apl_Val),1),(WeekStart=\"Monday\")+1)+$A8*7-6","v":"2020-04-27"},"2020-04-28","2020-04-29","2020-04-30","2020-05-01","2020-05-02","2020-05-03"]
[null,{"$f":"Days+DATE(CalYear,MONTH(Mar_Val),1)-WEEKDAY(DATE(CalYear,MONTH(Mar_Val),1),(WeekStart=\"Monday\")+1)+$A9*7-6","v":"2020-03-30"},"2020-03-31","2020-04-01","2020-04-02","2020-04-03","2020-04-04","2020-04-05",null,{"$f":"Days+DATE(CalYear,MONTH(Apl_Val),1)-WEEKDAY(DATE(CalYear,MONTH(Apl_Val),1),(WeekStart=\"Monday\")+1)+$A9*7-6","v":"2020-05-04"},"2020-05-05","2020-05-06","2020-05-07","2020-05-08","2020-05-09","2020-05-10"]
[null,{"$f":"UPPER(TEXT(May_Val,\"MMMM\"))","v":"MAGGIO"},{"$nulls":7},{"$f":"UPPER(TEXT(June_Val,\"MMMM\"))","v":"GIUGNO"}]
[null,{"$f":"CHOOSE(1+(WeekStart=\"Monday\"),\"Dom\",\"Lun\",\"Mar\",\"Mer\",\"Gio\",\"Ven\",\"Sab\",\"Dom\")","v":"Lun"},{"$f":"CHOOSE(2+(WeekStart=\"Monday\"),\"Dom\",\"Lun\",\"Mar\",\"Mer\",\"Gio\",\"Ven\",\"Sab\",\"Dom\")","v":"Mar"},{"$f":"CHOOSE(3+(WeekStart=\"Monday\"),\"Dom\",\"Lun\",\"Mar\",\"Mer\",\"Gio\",\"Ven\",\"Sab\",\"Dom\")","v":"Mer"},{"$f":"CHOOSE(4+(WeekStart=\"Monday\"),\"Dom\",\"Lun\",\"Mar\",\"Mer\",\"Gio\",\"Ven\",\"Sab\",\"Dom\")","v":"Gio"},{"$f":"CHOOSE(5+(WeekStart=\"Monday\"),\"Dom\",\"Lun\",\"Mar\",\"Mer\",\"Gio\",\"Ven\",\"Sab\",\"Dom\")","v":"Ven"},{"$f":"CHOOSE(6+(WeekStart=\"Monday\"),\"Dom\",\"Lun\",\"Mar\",\"Mer\",\"Gio\",\"Ven\",\"Sab\",\"Dom\")","v":"Sab"},{"$f":"CHOOSE(7+(WeekStart=\"Monday\"),\"Dom\",\"Lun\",\"Mar\",\"Mer\",\"Gio\",\"Ven\",\"Sab\",\"Dom\")","v":"Dom"},null,{"$f":"CHOOSE(1+(WeekStart=\"Monday\"),\"Dom\",\"Lun\",\"Mar\",\"Mer\",\"Gio\",\"Ven\",\"Sab\",\"Dom\")","v":"Lun"},{"$f":"CHOOSE(2+(WeekStart=\"Monday\"),\"Dom\",\"Lun\",\"Mar\",\"Mer\",\"Gio\",\"Ven\",\"Sab\",\"Dom\")","v":"Mar"},{"$f":"CHOOSE(3+(WeekStart=\"Monday\"),\"Dom\",\"Lun\",\"Mar\",\"Mer\",\"Gio\",\"Ven\",\"Sab\",\"Dom\")","v":"Mer"},{"$f":"CHOOSE(4+(WeekStart=\"Monday\"),\"Dom\",\"Lun\",\"Mar\",\"Mer\",\"Gio\",\"Ven\",\"Sab\",\"Dom\")","v":"Gio"},{"$f":"CHOOSE(5+(WeekStart=\"Monday\"),\"Dom\",\"Lun\",\"Mar\",\"Mer\",\"Gio\",\"Ven\",\"Sab\",\"Dom\")","v":"Ven"},{"$f":"CHOOSE(6+(WeekStart=\"Monday\"),\"Dom\",\"Lun\",\"Mar\",\"Mer\",\"Gio\",\"Ven\",\"Sab\",\"Dom\")","v":"Sab"},{"$f":"CHOOSE(7+(WeekStart=\"Monday\"),\"Dom\",\"Lun\",\"Mar\",\"Mer\",\"Gio\",\"Ven\",\"Sab\",\"Dom\")","v":"Dom"}]
[1,{"$f":"Days+DATE(CalYear,MONTH(May_Val),1)-WEEKDAY(DATE(CalYear,MONTH(May_Val),1),(WeekStart=\"Monday\")+1)+$A20*7-6","v":"2020-04-27"},"2020-04-28","2020-04-29","2020-04-30","2020-05-01","2020-05-02","2020-05-03",null,{"$f":"Days+DATE(CalYear,MONTH(June_Val),1)-WEEKDAY(DATE(CalYear,MONTH(June_Val),1),(WeekStart=\"Monday\")+1)+$A20*7-6","v":"2020-06-01"},"2020-06-02","2020-06-03","2020-06-04","2020-06-05","2020-06-06","2020-06-07"]
[2,{"$f":"Days+DATE(CalYear,MONTH(May_Val),1)-WEEKDAY(DATE(CalYear,MONTH(May_Val),1),(WeekStart=\"Monday\")+1)+$A21*7-6","v":"2020-05-04"},"2020-05-05","2020-05-06","2020-05-07","2020-05-08","2020-05-09","2020-05-10",null,{"$f":"Days+DATE(CalYear,MONTH(June_Val),1)-WEEKDAY(DATE(CalYear,MONTH(June_Val),1),(WeekStart=\"Monday\")+1)+$A21*7-6","v":"2020-06-08"},"2020-06-09","2020-06-10","2020-06-11","2020-06-12","2020-06-13","2020-06-14"]
[3,{"$f":"Days+DATE(CalYear,MONTH(May_Val),1)-WEEKDAY(DATE(CalYear,MONTH(May_Val),1),(WeekStart=\"Monday\")+1)+$A22*7-6","v":"2020-05-11"},"2020-05-12","2020-05-13","2020-05-14","2020-05-15","2020-05-16","2020-05-17",null,{"$f":"Days+DATE(CalYear,MONTH(June_Val),1)-WEEKDAY(DATE(CalYear,MONTH(June_Val),1),(WeekStart=\"Monday\")+1)+$A22*7-6","v":"2020-06-15"},"2020-06-16","2020-06-17","2020-06-18","2020-06-19","2020-06-20","2020-06-21"]
[4,{"$f":"Days+DATE(CalYear,MONTH(May_Val),1)-WEEKDAY(DATE(CalYear,MONTH(May_Val),1),(WeekStart=\"Monday\")+1)+$A23*7-6","v":"2020-05-18"},"2020-05-19","2020-05-20","2020-05-21","2020-05-22","2020-05-23","2020-05-24",null,{"$f":"Days+DATE(CalYear,MONTH(June_Val),1)-WEEKDAY(DATE(CalYear,MONTH(June_Val),1),(WeekStart=\"Monday\")+1)+$A23*7-6","v":"2020-06-22"},"2020-06-23","2020-06-24","2020-06-25","2020-06-26","2020-06-27","2020-06-28"]
[5,{"$f":"Days+DATE(CalYear,MONTH(May_Val),1)-WEEKDAY(DATE(CalYear,MONTH(May_Val),1),(WeekStart=\"Monday\")+1)+$A24*7-6","v":"2020-05-25"},"2020-05-26","2020-05-27","2020-05-28","2020-05-29","2020-05-30","2020-05-31",null,{"$f":"Days+DATE(CalYear,MONTH(June_Val),1)-WEEKDAY(DATE(CalYear,MONTH(June_Val),1),(WeekStart=\"Monday\")+1)+$A24*7-6","v":"2020-06-29"},"2020-06-30","2020-07-01","2020-07-02","2020-07-03","2020-07-04","2020-07-05"]
[6,{"$f":"Days+DATE(CalYear,MONTH(May_Val),1)-WEEKDAY(DATE(CalYear,MONTH(May_Val),1),(WeekStart=\"Monday\")+1)+$A25*7-6","v":"2020-06-01"},"2020-06-02","2020-06-03","2020-06-04","2020-06-05","2020-06-06","2020-06-07",null,{"$f":"Days+DATE(CalYear,MONTH(June_Val),1)-WEEKDAY(DATE(CalYear,MONTH(June_Val),1),(WeekStart=\"Monday\")+1)+$A25*7-6","v":"2020-07-06"},"2020-07-07","2020-07-08","2020-07-09","2020-07-10","2020-07-11","2020-07-12"]
[null,{"$f":"UPPER(TEXT(July_Val,\"MMMM\"))","v":"LUGLIO"},{"$nulls":7},{"$f":"UPPER(TEXT(Aug_Val,\"MMMM\"))","v":"AGOSTO"}]
[null,{"$f":"CHOOSE(1+(WeekStart=\"Monday\"),\"Dom\",\"Lun\",\"Mar\",\"Mer\",\"Gio\",\"Ven\",\"Sab\",\"Dom\")","v":"Lun"},{"$f":"CHOOSE(2+(WeekStart=\"Monday\"),\"Dom\",\"Lun\",\"Mar\",\"Mer\",\"Gio\",\"Ven\",\"Sab\",\"Dom\")","v":"Mar"},{"$f":"CHOOSE(3+(WeekStart=\"Monday\"),\"Dom\",\"Lun\",\"Mar\",\"Mer\",\"Gio\",\"Ven\",\"Sab\",\"Dom\")","v":"Mer"},{"$f":"CHOOSE(4+(WeekStart=\"Monday\"),\"Dom\",\"Lun\",\"Mar\",\"Mer\",\"Gio\",\"Ven\",\"Sab\",\"Dom\")","v":"Gio"},{"$f":"CHOOSE(5+(WeekStart=\"Monday\"),\"Dom\",\"Lun\",\"Mar\",\"Mer\",\"Gio\",\"Ven\",\"Sab\",\"Dom\")","v":"Ven"},{"$f":"CHOOSE(6+(WeekStart=\"Monday\"),\"Dom\",\"Lun\",\"Mar\",\"Mer\",\"Gio\",\"Ven\",\"Sab\",\"Dom\")","v":"Sab"},{"$f":"CHOOSE(7+(WeekStart=\"Monday\"),\"Dom\",\"Lun\",\"Mar\",\"Mer\",\"Gio\",\"Ven\",\"Sab\",\"Dom\")","v":"Dom"},null,{"$f":"CHOOSE(1+(WeekStart=\"Monday\"),\"Dom\",\"Lun\",\"Mar\",\"Mer\",\"Gio\",\"Ven\",\"Sab\",\"Dom\")","v":"Lun"},{"$f":"CHOOSE(2+(WeekStart=\"Monday\"),\"Dom\",\"Lun\",\"Mar\",\"Mer\",\"Gio\",\"Ven\",\"Sab\",\"Dom\")","v":"Mar"},{"$f":"CHOOSE(3+(WeekStart=\"Monday\"),\"Dom\",\"Lun\",\"Mar\",\"Mer\",\"Gio\",\"Ven\",\"Sab\",\"Dom\")","v":"Mer"},{"$f":"CHOOSE(4+(WeekStart=\"Monday\"),\"Dom\",\"Lun\",\"Mar\",\"Mer\",\"Gio\",\"Ven\",\"Sab\",\"Dom\")","v":"Gio"},{"$f":"CHOOSE(5+(WeekStart=\"Monday\"),\"Dom\",\"Lun\",\"Mar\",\"Mer\",\"Gio\",\"Ven\",\"Sab\",\"Dom\")","v":"Ven"},{"$f":"CHOOSE(6+(WeekStart=\"Monday\"),\"Dom\",\"Lun\",\"Mar\",\"Mer\",\"Gio\",\"Ven\",\"Sab\",\"Dom\")","v":"Sab"},{"$f":"CHOOSE(7+(WeekStart=\"Monday\"),\"Dom\",\"Lun\",\"Mar\",\"Mer\",\"Gio\",\"Ven\",\"Sab\",\"Dom\")","v":"Dom"}]
[null,{"$f":"Days+DATE(CalYear,MONTH(July_Val),1)-WEEKDAY(DATE(CalYear,MONTH(July_Val),1),(WeekStart=\"Monday\")+1)+$A20*7-6","v":"2020-06-29"},"2020-06-30","2020-07-01","2020-07-02","2020-07-03","2020-07-04","2020-07-05",null,{"$f":"Days+DATE(CalYear,MONTH(Aug_Val),1)-WEEKDAY(DATE(CalYear,MONTH(Aug_Val),1),(WeekStart=\"Monday\")+1)+$A20*7-6","v":"2020-07-27"},"2020-07-28","2020-07-29","2020-07-30","2020-07-31","2020-08-01","2020-08-02"]
[null,{"$f":"Days+DATE(CalYear,MONTH(July_Val),1)-WEEKDAY(DATE(CalYear,MONTH(July_Val),1),(WeekStart=\"Monday\")+1)+$A21*7-6","v":"2020-07-06"},"2020-07-07","2020-07-08","2020-07-09","2020-07-10","2020-07-11","2020-07-12",null,{"$f":"Days+DATE(CalYear,MONTH(Aug_Val),1)-WEEKDAY(DATE(CalYear,MONTH(Aug_Val),1),(WeekStart=\"Monday\")+1)+$A21*7-6","v":"2020-08-03"},"2020-08-04","2020-08-05","2020-08-06","2020-08-07","2020-08-08","2020-08-09"]
[null,{"$f":"Days+DATE(CalYear,MONTH(July_Val),1)-WEEKDAY(DATE(CalYear,MONTH(July_Val),1),(WeekStart=\"Monday\")+1)+$A22*7-6","v":"2020-07-13"},"2020-07-14","2020-07-15","2020-07-16","2020-07-17","2020-07-18","2020-07-19",null,{"$f":"Days+DATE(CalYear,MONTH(Aug_Val),1)-WEEKDAY(DATE(CalYear,MONTH(Aug_Val),1),(WeekStart=\"Monday\")+1)+$A22*7-6","v":"2020-08-10"},"2020-08-11","2020-08-12","2020-08-13","2020-08-14","2020-08-15","2020-08-16"]
[null,{"$f":"Days+DATE(CalYear,MONTH(July_Val),1)-WEEKDAY(DATE(CalYear,MONTH(July_Val),1),(WeekStart=\"Monday\")+1)+$A23*7-6","v":"2020-07-20"},"2020-07-21","2020-07-22","2020-07-23","2020-07-24","2020-07-25","2020-07-26",null,{"$f":"Days+DATE(CalYear,MONTH(Aug_Val),1)-WEEKDAY(DATE(CalYear,MONTH(Aug_Val),1),(WeekStart=\"Monday\")+1)+$A23*7-6","v":"2020-08-17"},"2020-08-18","2020-08-19","2020-08-20","2020-08-21","2020-08-22","2020-08-23"]
[null,{"$f":"Days+DATE(CalYear,MONTH(July_Val),1)-WEEKDAY(DATE(CalYear,MONTH(July_Val),1),(WeekStart=\"Monday\")+1)+$A24*7-6","v":"2020-07-27"},"2020-07-28","2020-07-29","2020-07-30","2020-07-31","2020-08-01","2020-08-02",null,{"$f":"Days+DATE(CalYear,MONTH(Aug_Val),1)-WEEKDAY(DATE(CalYear,MONTH(Aug_Val),1),(WeekStart=\"Monday\")+1)+$A24*7-6","v":"2020-08-24"},"2020-08-25","2020-08-26","2020-08-27","2020-08-28","2020-08-29","2020-08-30"]
[null,{"$f":"Days+DATE(CalYear,MONTH(July_Val),1)-WEEKDAY(DATE(CalYear,MONTH(July_Val),1),(WeekStart=\"Monday\")+1)+$A25*7-6","v":"2020-08-03"},"2020-08-04","2020-08-05","2020-08-06","2020-08-07","2020-08-08","2020-08-09",null,{"$f":"Days+DATE(CalYear,MONTH(Aug_Val),1)-WEEKDAY(DATE(CalYear,MONTH(Aug_Val),1),(WeekStart=\"Monday\")+1)+$A25*7-6","v":"2020-08-31"},"2020-09-01","2020-09-02","2020-09-03","2020-09-04","2020-09-05","2020-09-06"]
[null,{"$f":"UPPER(TEXT(Sep_Val,\"MMMM\"))","v":"SETTEMBRE"},{"$nulls":7},{"$f":"UPPER(TEXT(Oct_Val,\"MMMM\"))","v":"OTTOBRE"}]
[null,{"$f":"CHOOSE(1+(WeekStart=\"Monday\"),\"Dom\",\"Lun\",\"Mar\",\"Mer\",\"Gio\",\"Ven\",\"Sab\",\"Dom\")","v":"Lun"},{"$f":"CHOOSE(2+(WeekStart=\"Monday\"),\"Dom\",\"Lun\",\"Mar\",\"Mer\",\"Gio\",\"Ven\",\"Sab\",\"Dom\")","v":"Mar"},{"$f":"CHOOSE(3+(WeekStart=\"Monday\"),\"Dom\",\"Lun\",\"Mar\",\"Mer\",\"Gio\",\"Ven\",\"Sab\",\"Dom\")","v":"Mer"},{"$f":"CHOOSE(4+(WeekStart=\"Monday\"),\"Dom\",\"Lun\",\"Mar\",\"Mer\",\"Gio\",\"Ven\",\"Sab\",\"Dom\")","v":"Gio"},{"$f":"CHOOSE(5+(WeekStart=\"Monday\"),\"Dom\",\"Lun\",\"Mar\",\"Mer\",\"Gio\",\"Ven\",\"Sab\",\"Dom\")","v":"Ven"},{"$f":"CHOOSE(6+(WeekStart=\"Monday\"),\"Dom\",\"Lun\",\"Mar\",\"Mer\",\"Gio\",\"Ven\",\"Sab\",\"Dom\")","v":"Sab"},{"$f":"CHOOSE(7+(WeekStart=\"Monday\"),\"Dom\",\"Lun\",\"Mar\",\"Mer\",\"Gio\",\"Ven\",\"Sab\",\"Dom\")","v":"Dom"},null,{"$f":"CHOOSE(1+(WeekStart=\"Monday\"),\"Dom\",\"Lun\",\"Mar\",\"Mer\",\"Gio\",\"Ven\",\"Sab\",\"Dom\")","v":"Lun"},{"$f":"CHOOSE(2+(WeekStart=\"Monday\"),\"Dom\",\"Lun\",\"Mar\",\"Mer\",\"Gio\",\"Ven\",\"Sab\",\"Dom\")","v":"Mar"},{"$f":"CHOOSE(3+(WeekStart=\"Monday\"),\"Dom\",\"Lun\",\"Mar\",\"Mer\",\"Gio\",\"Ven\",\"Sab\",\"Dom\")","v":"Mer"},{"$f":"CHOOSE(4+(WeekStart=\"Monday\"),\"Dom\",\"Lun\",\"Mar\",\"Mer\",\"Gio\",\"Ven\",\"Sab\",\"Dom\")","v":"Gio"},{"$f":"CHOOSE(5+(WeekStart=\"Monday\"),\"Dom\",\"Lun\",\"Mar\",\"Mer\",\"Gio\",\"Ven\",\"Sab\",\"Dom\")","v":"Ven"},{"$f":"CHOOSE(6+(WeekStart=\"Monday\"),\"Dom\",\"Lun\",\"Mar\",\"Mer\",\"Gio\",\"Ven\",\"Sab\",\"Dom\")","v":"Sab"},{"$f":"CHOOSE(7+(WeekStart=\"Monday\"),\"Dom\",\"Lun\",\"Mar\",\"Mer\",\"Gio\",\"Ven\",\"Sab\",\"Dom\")","v":"Dom"}]
[1,{"$f":"Days+DATE(CalYear,MONTH(Sep_Val),1)-WEEKDAY(DATE(CalYear,MONTH(Sep_Val),1),(WeekStart=\"Monday\")+1)+$A36*7-6","v":"2020-08-31"},"2020-09-01","2020-09-02","2020-09-03","2020-09-04","2020-09-05","2020-09-06",null,{"$f":"Days+DATE(CalYear,MONTH(Oct_Val),1)-WEEKDAY(DATE(CalYear,MONTH(Oct_Val),1),(WeekStart=\"Monday\")+1)+$A36*7-6","v":"2020-09-28"},"2020-09-29","2020-09-30","2020-10-01","2020-10-02","2020-10-03","2020-10-04"]
[2,{"$f":"Days+DATE(CalYear,MONTH(Sep_Val),1)-WEEKDAY(DATE(CalYear,MONTH(Sep_Val),1),(WeekStart=\"Monday\")+1)+$A37*7-6","v":"2020-09-07"},"2020-09-08","2020-09-09","2020-09-10","2020-09-11","2020-09-12","2020-09-13",null,{"$f":"Days+DATE(CalYear,MONTH(Oct_Val),1)-WEEKDAY(DATE(CalYear,MONTH(Oct_Val),1),(WeekStart=\"Monday\")+1)+$A37*7-6","v":"2020-10-05"},"2020-10-06","2020-10-07","2020-10-08","2020-10-09","2020-10-10","2020-10-11"]
[3,{"$f":"Days+DATE(CalYear,MONTH(Sep_Val),1)-WEEKDAY(DATE(CalYear,MONTH(Sep_Val),1),(WeekStart=\"Monday\")+1)+$A38*7-6","v":"2020-09-14"},"2020-09-15","2020-09-16","2020-09-17","2020-09-18","2020-09-19","2020-09-20",null,{"$f":"Days+DATE(CalYear,MONTH(Oct_Val),1)-WEEKDAY(DATE(CalYear,MONTH(Oct_Val),1),(WeekStart=\"Monday\")+1)+$A38*7-6","v":"2020-10-12"},"2020-10-13","2020-10-14","2020-10-15","2020-10-16","2020-10-17","2020-10-18"]
[4,{"$f":"Days+DATE(CalYear,MONTH(Sep_Val),1)-WEEKDAY(DATE(CalYear,MONTH(Sep_Val),1),(WeekStart=\"Monday\")+1)+$A39*7-6","v":"2020-09-21"},"2020-09-22","2020-09-23","2020-09-24","2020-09-25","2020-09-26","2020-09-27",null,{"$f":"Days+DATE(CalYear,MONTH(Oct_Val),1)-WEEKDAY(DATE(CalYear,MONTH(Oct_Val),1),(WeekStart=\"Monday\")+1)+$A39*7-6","v":"2020-10-19"},"2020-10-20","2020-10-21","2020-10-22","2020-10-23","2020-10-24","2020-10-25"]
[5,{"$f":"Days+DATE(CalYear,MONTH(Sep_Val),1)-WEEKDAY(DATE(CalYear,MONTH(Sep_Val),1),(WeekStart=\"Monday\")+1)+$A40*7-6","v":"2020-09-28"},"2020-09-29","2020-09-30","2020-10-01","2020-10-02","2020-10-03","2020-10-04",null,{"$f":"Days+DATE(CalYear,MONTH(Oct_Val),1)-WEEKDAY(DATE(CalYear,MONTH(Oct_Val),1),(WeekStart=\"Monday\")+1)+$A40*7-6","v":"2020-10-26"},"2020-10-27","2020-10-28","2020-10-29","2020-10-30","2020-10-31","2020-11-01"]
[6,{"$f":"Days+DATE(CalYear,MONTH(Sep_Val),1)-WEEKDAY(DATE(CalYear,MONTH(Sep_Val),1),(WeekStart=\"Monday\")+1)+$A41*7-6","v":"2020-10-05"},"2020-10-06","2020-10-07","2020-10-08","2020-10-09","2020-10-10","2020-10-11",null,{"$f":"Days+DATE(CalYear,MONTH(Oct_Val),1)-WEEKDAY(DATE(CalYear,MONTH(Oct_Val),1),(WeekStart=\"Monday\")+1)+$A41*7-6","v":"2020-11-02"},"2020-11-03","2020-11-04","2020-11-05","2020-11-06","2020-11-07","2020-11-08"]
[null,{"$f":"UPPER(TEXT(Nov_Val,\"MMMM\"))","v":"NOVEMBRE"},{"$nulls":7},{"$f":"UPPER(TEXT(Dec_Val,\"MMMM\"))","v":"DICEMBRE"}]
[null,{"$f":"CHOOSE(1+(WeekStart=\"Monday\"),\"Dom\",\"Lun\",\"Mar\",\"Mer\",\"Gio\",\"Ven\",\"Sab\",\"Dom\")","v":"Lun"},{"$f":"CHOOSE(2+(WeekStart=\"Monday\"),\"Dom\",\"Lun\",\"Mar\",\"Mer\",\"Gio\",\"Ven\",\"Sab\",\"Dom\")","v":"Mar"},{"$f":"CHOOSE(3+(WeekStart=\"Monday\"),\"Dom\",\"Lun\",\"Mar\",\"Mer\",\"Gio\",\"Ven\",\"Sab\",\"Dom\")","v":"Mer"},{"$f":"CHOOSE(4+(WeekStart=\"Monday\"),\"Dom\",\"Lun\",\"Mar\",\"Mer\",\"Gio\",\"Ven\",\"Sab\",\"Dom\")","v":"Gio"},{"$f":"CHOOSE(5+(WeekStart=\"Monday\"),\"Dom\",\"Lun\",\"Mar\",\"Mer\",\"Gio\",\"Ven\",\"Sab\",\"Dom\")","v":"Ven"},{"$f":"CHOOSE(6+(WeekStart=\"Monday\"),\"Dom\",\"Lun\",\"Mar\",\"Mer\",\"Gio\",\"Ven\",\"Sab\",\"Dom\")","v":"Sab"},{"$f":"CHOOSE(7+(WeekStart=\"Monday\"),\"Dom\",\"Lun\",\"Mar\",\"Mer\",\"Gio\",\"Ven\",\"Sab\",\"Dom\")","v":"Dom"},null,{"$f":"CHOOSE(1+(WeekStart=\"Monday\"),\"Dom\",\"Lun\",\"Mar\",\"Mer\",\"Gio\",\"Ven\",\"Sab\",\"Dom\")","v":"Lun"},{"$f":"CHOOSE(2+(WeekStart=\"Monday\"),\"Dom\",\"Lun\",\"Mar\",\"Mer\",\"Gio\",\"Ven\",\"Sab\",\"Dom\")","v":"Mar"},{"$f":"CHOOSE(3+(WeekStart=\"Monday\"),\"Dom\",\"Lun\",\"Mar\",\"Mer\",\"Gio\",\"Ven\",\"Sab\",\"Dom\")","v":"Mer"},{"$f":"CHOOSE(4+(WeekStart=\"Monday\"),\"Dom\",\"Lun\",\"Mar\",\"Mer\",\"Gio\",\"Ven\",\"Sab\",\"Dom\")","v":"Gio"},{"$f":"CHOOSE(5+(WeekStart=\"Monday\"),\"Dom\",\"Lun\",\"Mar\",\"Mer\",\"Gio\",\"Ven\",\"Sab\",\"Dom\")","v":"Ven"},{"$f":"CHOOSE(6+(WeekStart=\"Monday\"),\"Dom\",\"Lun\",\"Mar\",\"Mer\",\"Gio\",\"Ven\",\"Sab\",\"Dom\")","v":"Sab"},{"$f":"CHOOSE(7+(WeekStart=\"Monday\"),\"Dom\",\"Lun\",\"Mar\",\"Mer\",\"Gio\",\"Ven\",\"Sab\",\"Dom\")","v":"Dom"}]
[null,{"$f":"Days+DATE(CalYear,MONTH(Nov_Val),1)-WEEKDAY(DATE(CalYear,MONTH(Nov_Val),1),(WeekStart=\"Monday\")+1)+$A36*7-6","v":"2020-10-26"},"2020-10-27","2020-10-28","2020-10-29","2020-10-30","2020-10-31","2020-11-01",null,{"$f":"Days+DATE(CalYear,MONTH(Dec_Val),1)-WEEKDAY(DATE(CalYear,MONTH(Dec_Val),1),(WeekStart=\"Monday\")+1)+$A36*7-6","v":"2020-11-30"},"2020-12-01","2020-12-02","2020-12-03","2020-12-04","2020-12-05","2020-12-06"]
[null,{"$f":"Days+DATE(CalYear,MONTH(Nov_Val),1)-WEEKDAY(DATE(CalYear,MONTH(Nov_Val),1),(WeekStart=\"Monday\")+1)+$A37*7-6","v":"2020-11-02"},"2020-11-03","2020-11-04","2020-11-05","2020-11-06","2020-11-07","2020-11-08",null,{"$f":"Days+DATE(CalYear,MONTH(Dec_Val),1)-WEEKDAY(DATE(CalYear,MONTH(Dec_Val),1),(WeekStart=\"Monday\")+1)+$A37*7-6","v":"2020-12-07"},"2020-12-08","2020-12-09","2020-12-10","2020-12-11","2020-12-12","2020-12-13"]
[null,{"$f":"Days+DATE(CalYear,MONTH(Nov_Val),1)-WEEKDAY(DATE(CalYear,MONTH(Nov_Val),1),(WeekStart=\"Monday\")+1)+$A38*7-6","v":"2020-11-09"},"2020-11-10","2020-11-11","2020-11-12","2020-11-13","2020-11-14","2020-11-15",null,{"$f":"Days+DATE(CalYear,MONTH(Dec_Val),1)-WEEKDAY(DATE(CalYear,MONTH(Dec_Val),1),(WeekStart=\"Monday\")+1)+$A38*7-6","v":"2020-12-14"},"2020-12-15","2020-12-16","2020-12-17","2020-12-18","2020-12-19","2020-12-20"]
[null,{"$f":"Days+DATE(CalYear,MONTH(Nov_Val),1)-WEEKDAY(DATE(CalYear,MONTH(Nov_Val),1),(WeekStart=\"Monday\")+1)+$A39*7-6","v":"2020-11-16"},"2020-11-17","2020-11-18","2020-11-19","2020-11-20","2020-11-21","2020-11-22",null,{"$f":"Days+DATE(CalYear,MONTH(Dec_Val),1)-WEEKDAY(DATE(CalYear,MONTH(Dec_Val),1),(WeekStart=\"Monday\")+1)+$A39*7-6","v":"2020-12-21"},"2020-12-22","2020-12-23","2020-12-24","2020-12-25","2020-12-26","2020-12-27"]
[null,{"$f":"Days+DATE(CalYear,MONTH(Nov_Val),1)-WEEKDAY(DATE(CalYear,MONTH(Nov_Val),1),(WeekStart=\"Monday\")+1)+$A40*7-6","v":"2020-11-23"},"2020-11-24","2020-11-25","2020-11-26","2020-11-27","2020-11-28","2020-11-29",null,{"$f":"Days+DATE(CalYear,MONTH(Dec_Val),1)-WEEKDAY(DATE(CalYear,MONTH(Dec_Val),1),(WeekStart=\"Monday\")+1)+$A40*7-6","v":"2020-12-28"},"2020-12-29","2020-12-30","2020-12-31","2021-01-01","2021-01-02","2021-01-03"]
[null,{"$f":"Days+DATE(CalYear,MONTH(Nov_Val),1)-WEEKDAY(DATE(CalYear,MONTH(Nov_Val),1),(WeekStart=\"Monday\")+1)+$A41*7-6","v":"2020-11-30"},"2020-12-01","2020-12-02","2020-12-03","2020-12-04","2020-12-05","2020-12-06",null,{"$f":"Days+DATE(CalYear,MONTH(Dec_Val),1)-WEEKDAY(DATE(CalYear,MONTH(Dec_Val),1),(WeekStart=\"Monday\")+1)+$A41*7-6","v":"2021-01-04"},"2021-01-05","2021-01-06","2021-01-07","2021-01-08","2021-01-09","2021-01-10"]

{"sheet":"CALENDARIO 2021","index":1,"n_rows":49,"n_cols":16,"rows_kept":49,"merged":[[0,1,0,15],[1,1,1,7],[1,9,1,15],[9,1,9,7],[9,9,9,15],[17,1,17,7],[17,9,17,15],[25,1,25,7],[25,9,25,15],[33,1,33,7],[33,9,33,15],[41,1,41,7],[41,9,41,15]]}
[null,{"$f":"YEAR(TODAY())+1","v":2021}]
[null,{"$f":"UPPER(TEXT(Jan_Val,\"MMMM\"))","v":"GENNAIO"},{"$nulls":7},{"$f":"UPPER(TEXT(Feb_Val,\"MMMM\"))","v":"FEBBRAIO"}]
[null,{"$f":"CHOOSE(1+(WeekStart=\"Monday\"),\"Dom\",\"Lun\",\"Mar\",\"Mer\",\"Gio\",\"Ven\",\"Sab\",\"Dom\")","v":"Lun"},{"$f":"CHOOSE(2+(WeekStart=\"Monday\"),\"Dom\",\"Lun\",\"Mar\",\"Mer\",\"Gio\",\"Ven\",\"Sab\",\"Dom\")","v":"Mar"},{"$f":"CHOOSE(3+(WeekStart=\"Monday\"),\"Dom\",\"Lun\",\"Mar\",\"Mer\",\"Gio\",\"Ven\",\"Sab\",\"Dom\")","v":"Mer"},{"$f":"CHOOSE(4+(WeekStart=\"Monday\"),\"Dom\",\"Lun\",\"Mar\",\"Mer\",\"Gio\",\"Ven\",\"Sab\",\"Dom\")","v":"Gio"},{"$f":"CHOOSE(5+(WeekStart=\"Monday\"),\"Dom\",\"Lun\",\"Mar\",\"Mer\",\"Gio\",\"Ven\",\"Sab\",\"Dom\")","v":"Ven"},{"$f":"CHOOSE(6+(WeekStart=\"Monday\"),\"Dom\",\"Lun\",\"Mar\",\"Mer\",\"Gio\",\"Ven\",\"Sab\",\"Dom\")","v":"Sab"},{"$f":"CHOOSE(7+(WeekStart=\"Monday\"),\"Dom\",\"Lun\",\"Mar\",\"Mer\",\"Gio\",\"Ven\",\"Sab\",\"Dom\")","v":"Dom"},null,{"$f":"CHOOSE(1+(WeekStart=\"Monday\"),\"Dom\",\"Lun\",\"Mar\",\"Mer\",\"Gio\",\"Ven\",\"Sab\",\"Dom\")","v":"Lun"},{"$f":"CHOOSE(2+(WeekStart=\"Monday\"),\"Dom\",\"Lun\",\"Mar\",\"Mer\",\"Gio\",\"Ven\",\"Sab\",\"Dom\")","v":"Mar"},{"$f":"CHOOSE(3+(WeekStart=\"Monday\"),\"Dom\",\"Lun\",\"Mar\",\"Mer\",\"Gio\",\"Ven\",\"Sab\",\"Dom\")","v":"Mer"},{"$f":"CHOOSE(4+(WeekStart=\"Monday\"),\"Dom\",\"Lun\",\"Mar\",\"Mer\",\"Gio\",\"Ven\",\"Sab\",\"Dom\")","v":"Gio"},{"$f":"CHOOSE(5+(WeekStart=\"Monday\"),\"Dom\",\"Lun\",\"Mar\",\"Mer\",\"Gio\",\"Ven\",\"Sab\",\"Dom\")","v":"Ven"},{"$f":"CHOOSE(6+(WeekStart=\"Monday\"),\"Dom\",\"Lun\",\"Mar\",\"Mer\",\"Gio\",\"Ven\",\"Sab\",\"Dom\")","v":"Sab"},{"$f":"CHOOSE(7+(WeekStart=\"Monday\"),\"Dom\",\"Lun\",\"Mar\",\"Mer\",\"Gio\",\"Ven\",\"Sab\",\"Dom\")","v":"Dom"}]
[1,{"$f":"Days+DATE(CalYear,MONTH(Jan_Val),1)-WEEKDAY(DATE(CalYear,MONTH(Jan_Val),1),(WeekStart=\"Monday\")+1)+$A4*7-6","v":"2020-12-28"},"2020-12-29","2020-12-30","2020-12-31","2021-01-01","2021-01-02","2021-01-03",null,{"$f":"Days+DATE(CalYear,MONTH(Feb_Val),1)-WEEKDAY(DATE(CalYear,MONTH(Feb_Val),1),(WeekStart=\"Monday\")+1)+$A4*7-6","v":"2021-02-01"},"2021-02-02","2021-02-03","2021-02-04","2021-02-05","2021-02-06","2021-02-07"]
[2,{"$f":"Days+DATE(CalYear,MONTH(Jan_Val),1)-WEEKDAY(DATE(CalYear,MONTH(Jan_Val),1),(WeekStart=\"Monday\")+1)+$A5*7-6","v":"2021-01-04"},"2021-01-05","2021-01-06","2021-01-07","2021-01-08","2021-01-09","2021-01-10",null,{"$f":"Days+DATE(CalYear,MONTH(Feb_Val),1)-WEEKDAY(DATE(CalYear,MONTH(Feb_Val),1),(WeekStart=\"Monday\")+1)+$A5*7-6","v":"2021-02-08"},"2021-02-09","2021-02-10","2021-02-11","2021-02-12","2021-02-13","2021-02-14"]
[3,{"$f":"Days+DATE(CalYear,MONTH(Jan_Val),1)-WEEKDAY(DATE(CalYear,MONTH(Jan_Val),1),(WeekStart=\"Monday\")+1)+$A6*7-6","v":"2021-01-11"},"2021-01-12","2021-01-13","2021-01-14","2021-01-15","2021-01-16","2021-01-17",null,{"$f":"Days+DATE(CalYear,MONTH(Feb_Val),1)-WEEKDAY(DATE(CalYear,MONTH(Feb_Val),1),(WeekStart=\"Monday\")+1)+$A6*7-6","v":"2021-02-15"},"2021-02-16","2021-02-17","2021-02-18","2021-02-19","2021-02-20","2021-02-21"]
[4,{"$f":"Days+DATE(CalYear,MONTH(Jan_Val),1)-WEEKDAY(DATE(CalYear,MONTH(Jan_Val),1),(WeekStart=\"Monday\")+1)+$A7*7-6","v":"2021-01-18"},"2021-01-19","2021-01-20","2021-01-21","2021-01-22","2021-01-23","2021-01-24",null,{"$f":"Days+DATE(CalYear,MONTH(Feb_Val),1)-WEEKDAY(DATE(CalYear,MONTH(Feb_Val),1),(WeekStart=\"Monday\")+1)+$A7*7-6","v":"2021-02-22"},"2021-02-23","2021-02-24","2021-02-25","2021-02-26","2021-02-27","2021-02-28"]
[5,{"$f":"Days+DATE(CalYear,MONTH(Jan_Val),1)-WEEKDAY(DATE(CalYear,MONTH(Jan_Val),1),(WeekStart=\"Monday\")+1)+$A8*7-6","v":"2021-01-25"},"2021-01-26","2021-01-27","2021-01-28","2021-01-29","2021-01-30","2021-01-31",null,{"$f":"Days+DATE(CalYear,MONTH(Feb_Val),1)-WEEKDAY(DATE(CalYear,MONTH(Feb_Val),1),(WeekStart=\"Monday\")+1)+$A8*7-6","v":"2021-03-01"},"2021-03-02","2021-03-03","2021-03-04","2021-03-05","2021-03-06","2021-03-07"]
[6,{"$f":"Days+DATE(CalYear,MONTH(Jan_Val),1)-WEEKDAY(DATE(CalYear,MONTH(Jan_Val),1),(WeekStart=\"Monday\")+1)+$A9*7-6","v":"2021-02-01"},"2021-02-02","2021-02-03","2021-02-04","2021-02-05","2021-02-06","2021-02-07",null,{"$f":"Days+DATE(CalYear,MONTH(Feb_Val),1)-WEEKDAY(DATE(CalYear,MONTH(Feb_Val),1),(WeekStart=\"Monday\")+1)+$A9*7-6","v":"2021-03-08"},"2021-03-09","2021-03-10","2021-03-11","2021-03-12","2021-03-13","2021-03-14"]
[null,{"$f":"UPPER(TEXT(Mar_Val,\"MMMM\"))","v":"MARZO"},{"$nulls":7},{"$f":"UPPER(TEXT(Apl_Val,\"MMMM\"))","v":"APRILE"}]
[null,{"$f":"CHOOSE(1+(WeekStart=\"Monday\"),\"Dom\",\"Lun\",\"Mar\",\"Mer\",\"Gio\",\"Ven\",\"Sab\",\"Dom\")","v":"Lun"},{"$f":"CHOOSE(2+(WeekStart=\"Monday\"),\"Dom\",\"Lun\",\"Mar\",\"Mer\",\"Gio\",\"Ven\",\"Sab\",\"Dom\")","v":"Mar"},{"$f":"CHOOSE(3+(WeekStart=\"Monday\"),\"Dom\",\"Lun\",\"Mar\",\"Mer\",\"Gio\",\"Ven\",\"Sab\",\"Dom\")","v":"Mer"},{"$f":"CHOOSE(4+(WeekStart=\"Monday\"),\"Dom\",\"Lun\",\"Mar\",\"Mer\",\"Gio\",\"Ven\",\"Sab\",\"Dom\")","v":"Gio"},{"$f":"CHOOSE(5+(WeekStart=\"Monday\"),\"Dom\",\"Lun\",\"Mar\",\"Mer\",\"Gio\",\"Ven\",\"Sab\",\"Dom\")","v":"Ven"},{"$f":"CHOOSE(6+(WeekStart=\"Monday\"),\"Dom\",\"Lun\",\"Mar\",\"Mer\",\"Gio\",\"Ven\",\"Sab\",\"Dom\")","v":"Sab"},{"$f":"CHOOSE(7+(WeekStart=\"Monday\"),\"Dom\",\"Lun\",\"Mar\",\"Mer\",\"Gio\",\"Ven\",\"Sab\",\"Dom\")","v":"Dom"},null,{"$f":"CHOOSE(1+(WeekStart=\"Monday\"),\"Dom\",\"Lun\",\"Mar\",\"Mer\",\"Gio\",\"Ven\",\"Sab\",\"Dom\")","v":"Lun"},{"$f":"CHOOSE(2+(WeekStart=\"Monday\"),\"Dom\",\"Lun\",\"Mar\",\"Mer\",\"Gio\",\"Ven\",\"Sab\",\"Dom\")","v":"Mar"},{"$f":"CHOOSE(3+(WeekStart=\"Monday\"),\"Dom\",\"Lun\",\"Mar\",\"Mer\",\"Gio\",\"Ven\",\"Sab\",\"Dom\")","v":"Mer"},{"$f":"CHOOSE(4+(WeekStart=\"Monday\"),\"Dom\",\"Lun\",\"Mar\",\"Mer\",\"Gio\",\"Ven\",\"Sab\",\"Dom\")","v":"Gio"},{"$f":"CHOOSE(5+(WeekStart=\"Monday\"),\"Dom\",\"Lun\",\"Mar\",\"Mer\",\"Gio\",\"Ven\",\"Sab\",\"Dom\")","v":"Ven"},{"$f":"CHOOSE(6+(WeekStart=\"Monday\"),\"Dom\",\"Lun\",\"Mar\",\"Mer\",\"Gio\",\"Ven\",\"Sab\",\"Dom\")","v":"Sab"},{"$f":"CHOOSE(7+(WeekStart=\"Monday\"),\"Dom\",\"Lun\",\"Mar\",\"Mer\",\"Gio\",\"Ven\",\"Sab\",\"Dom\")","v":"Dom"}]
[null,{"$f":"Days+DATE(CalYear,MONTH(Mar_Val),1)-WEEKDAY(DATE(CalYear,MONTH(Mar_Val),1),(WeekStart=\"Monday\")+1)+$A4*7-6","v":"2021-03-01"},"2021-03-02","2021-03-03","2021-03-04","2021-03-05","2021-03-06","2021-03-07",null,{"$f":"Days+DATE(CalYear,MONTH(Apl_Val),1)-WEEKDAY(DATE(CalYear,MONTH(Apl_Val),1),(WeekStart=\"Monday\")+1)+$A4*7-6","v":"2021-03-29"},"2021-03-30","2021-03-31","2021-04-01","2021-04-02","2021-04-03","2021-04-04"]
[null,{"$f":"Days+DATE(CalYear,MONTH(Mar_Val),1)-WEEKDAY(DATE(CalYear,MONTH(Mar_Val),1),(WeekStart=\"Monday\")+1)+$A5*7-6","v":"2021-03-08"},"2021-03-09","2021-03-10","2021-03-11","2021-03-12","2021-03-13","2021-03-14",null,{"$f":"Days+DATE(CalYear,MONTH(Apl_Val),1)-WEEKDAY(DATE(CalYear,MONTH(Apl_Val),1),(WeekStart=\"Monday\")+1)+$A5*7-6","v":"2021-04-05"},"2021-04-06","2021-04-07","2021-04-08","2021-04-09","2021-04-10","2021-04-11"]
[null,{"$f":"Days+DATE(CalYear,MONTH(Mar_Val),1)-WEEKDAY(DATE(CalYear,MONTH(Mar_Val),1),(WeekStart=\"Monday\")+1)+$A6*7-6","v":"2021-03-15"},"2021-03-16","2021-03-17","2021-03-18","2021-03-19","2021-03-20","2021-03-21",null,{"$f":"Days+DATE(CalYear,MONTH(Apl_Val),1)-WEEKDAY(DATE(CalYear,MONTH(Apl_Val),1),(WeekStart=\"Monday\")+1)+$A6*7-6","v":"2021-04-12"},"2021-04-13","2021-04-14","2021-04-15","2021-04-16","2021-04-17","2021-04-18"]
[null,{"$f":"Days+DATE(CalYear,MONTH(Mar_Val),1)-WEEKDAY(DATE(CalYear,MONTH(Mar_Val),1),(WeekStart=\"Monday\")+1)+$A7*7-6","v":"2021-03-22"},"2021-03-23","2021-03-24","2021-03-25","2021-03-26","2021-03-27","2021-03-28",null,{"$f":"Days+DATE(CalYear,MONTH(Apl_Val),1)-WEEKDAY(DATE(CalYear,MONTH(Apl_Val),1),(WeekStart=\"Monday\")+1)+$A7*7-6","v":"2021-04-19"},"2021-04-20","2021-04-21","2021-04-22","2021-04-23","2021-04-24","2021-04-25"]
[null,{"$f":"Days+DATE(CalYear,MONTH(Mar_Val),1)-WEEKDAY(DATE(CalYear,MONTH(Mar_Val),1),(WeekStart=\"Monday\")+1)+$A8*7-6","v":"2021-03-29"},"2021-03-30","2021-03-31","2021-04-01","2021-04-02","2021-04-03","2021-04-04",null,{"$f":"Days+DATE(CalYear,MONTH(Apl_Val),1)-WEEKDAY(DATE(CalYear,MONTH(Apl_Val),1),(WeekStart=\"Monday\")+1)+$A8*7-6","v":"2021-04-26"},"2021-04-27","2021-04-28","2021-04-29","2021-04-30","2021-05-01","2021-05-02"]
[null,{"$f":"Days+DATE(CalYear,MONTH(Mar_Val),1)-WEEKDAY(DATE(CalYear,MONTH(Mar_Val),1),(WeekStart=\"Monday\")+1)+$A9*7-6","v":"2021-04-05"},"2021-04-06","2021-04-07","2021-04-08","2021-04-09","2021-04-10","2021-04-11",null,{"$f":"Days+DATE(CalYear,MONTH(Apl_Val),1)-WEEKDAY(DATE(CalYear,MONTH(Apl_Val),1),(WeekStart=\"Monday\")+1)+$A9*7-6","v":"2021-05-03"},"2021-05-04","2021-05-05","2021-05-06","2021-05-07","2021-05-08","2021-05-09"]
[null,{"$f":"UPPER(TEXT(May_Val,\"MMMM\"))","v":"MAGGIO"},{"$nulls":7},{"$f":"UPPER(TEXT(June_Val,\"MMMM\"))","v":"GIUGNO"}]
[null,{"$f":"CHOOSE(1+(WeekStart=\"Monday\"),\"Dom\",\"Lun\",\"Mar\",\"Mer\",\"Gio\",\"Ven\",\"Sab\",\"Dom\")","v":"Lun"},{"$f":"CHOOSE(2+(WeekStart=\"Monday\"),\"Dom\",\"Lun\",\"Mar\",\"Mer\",\"Gio\",\"Ven\",\"Sab\",\"Dom\")","v":"Mar"},{"$f":"CHOOSE(3+(WeekStart=\"Monday\"),\"Dom\",\"Lun\",\"Mar\",\"Mer\",\"Gio\",\"Ven\",\"Sab\",\"Dom\")","v":"Mer"},{"$f":"CHOOSE(4+(WeekStart=\"Monday\"),\"Dom\",\"Lun\",\"Mar\",\"Mer\",\"Gio\",\"Ven\",\"Sab\",\"Dom\")","v":"Gio"},{"$f":"CHOOSE(5+(WeekStart=\"Monday\"),\"Dom\",\"Lun\",\"Mar\",\"Mer\",\"Gio\",\"Ven\",\"Sab\",\"Dom\")","v":"Ven"},{"$f":"CHOOSE(6+(WeekStart=\"Monday\"),\"Dom\",\"Lun\",\"Mar\",\"Mer\",\"Gio\",\"Ven\",\"Sab\",\"Dom\")","v":"Sab"},{"$f":"CHOOSE(7+(WeekStart=\"Monday\"),\"Dom\",\"Lun\",\"Mar\",\"Mer\",\"Gio\",\"Ven\",\"Sab\",\"Dom\")","v":"Dom"},null,{"$f":"CHOOSE(1+(WeekStart=\"Monday\"),\"Dom\",\"Lun\",\"Mar\",\"Mer\",\"Gio\",\"Ven\",\"Sab\",\"Dom\")","v":"Lun"},{"$f":"CHOOSE(2+(WeekStart=\"Monday\"),\"Dom\",\"Lun\",\"Mar\",\"Mer\",\"Gio\",\"Ven\",\"Sab\",\"Dom\")","v":"Mar"},{"$f":"CHOOSE(3+(WeekStart=\"Monday\"),\"Dom\",\"Lun\",\"Mar\",\"Mer\",\"Gio\",\"Ven\",\"Sab\",\"Dom\")","v":"Mer"},{"$f":"CHOOSE(4+(WeekStart=\"Monday\"),\"Dom\",\"Lun\",\"Mar\",\"Mer\",\"Gio\",\"Ven\",\"Sab\",\"Dom\")","v":"Gio"},{"$f":"CHOOSE(5+(WeekStart=\"Monday\"),\"Dom\",\"Lun\",\"Mar\",\"Mer\",\"Gio\",\"Ven\",\"Sab\",\"Dom\")","v":"Ven"},{"$f":"CHOOSE(6+(WeekStart=\"Monday\"),\"Dom\",\"Lun\",\"Mar\",\"Mer\",\"Gio\",\"Ven\",\"Sab\",\"Dom\")","v":"Sab"},{"$f":"CHOOSE(7+(WeekStart=\"Monday\"),\"Dom\",\"Lun\",\"Mar\",\"Mer\",\"Gio\",\"Ven\",\"Sab\",\"Dom\")","v":"Dom"}]
[1,{"$f":"Days+DATE(CalYear,MONTH(May_Val),1)-WEEKDAY(DATE(CalYear,MONTH(May_Val),1),(WeekStart=\"Monday\")+1)+$A20*7-6","v":"2021-04-26"},"2021-04-27","2021-04-28","2021-04-29","2021-04-30","2021-05-01","2021-05-02",null,{"$f":"Days+DATE(CalYear,MONTH(June_Val),1)-WEEKDAY(DATE(CalYear,MONTH(June_Val),1),(WeekStart=\"Monday\")+1)+$A20*7-6","v":"2021-05-31"},"2021-06-01","2021-06-02","2021-06-03","2021-06-04","2021-06-05","2021-06-06"]
[2,{"$f":"Days+DATE(CalYear,MONTH(May_Val),1)-WEEKDAY(DATE(CalYear,MONTH(May_Val),1),(WeekStart=\"Monday\")+1)+$A21*7-6","v":"2021-05-03"},"2021-05-04","2021-05-05","2021-05-06","2021-05-07","2021-05-08","2021-05-09",null,{"$f":"Days+DATE(CalYear,MONTH(June_Val),1)-WEEKDAY(DATE(CalYear,MONTH(June_Val),1),(WeekStart=\"Monday\")+1)+$A21*7-6","v":"2021-06-07"},"2021-06-08","2021-06-09","2021-06-10","2021-06-11","2021-06-12","2021-06-13"]
[3,{"$f":"Days+DATE(CalYear,MONTH(May_Val),1)-WEEKDAY(DATE(CalYear,MONTH(May_Val),1),(WeekStart=\"Monday\")+1)+$A22*7-6","v":"2021-05-10"},"2021-05-11","2021-05-12","2021-05-13","2021-05-14","2021-05-15","2021-05-16",null,{"$f":"Days+DATE(CalYear,MONTH(June_Val),1)-WEEKDAY(DATE(CalYear,MONTH(June_Val),1),(WeekStart=\"Monday\")+1)+$A22*7-6","v":"2021-06-14"},"2021-06-15","2021-06-16","2021-06-17","2021-06-18","2021-06-19","2021-06-20"]
[4,{"$f":"Days+DATE(CalYear,MONTH(May_Val),1)-WEEKDAY(DATE(CalYear,MONTH(May_Val),1),(WeekStart=\"Monday\")+1)+$A23*7-6","v":"2021-05-17"},"2021-05-18","2021-05-19","2021-05-20","2021-05-21","2021-05-22","2021-05-23",null,{"$f":"Days+DATE(CalYear,MONTH(June_Val),1)-WEEKDAY(DATE(CalYear,MONTH(June_Val),1),(WeekStart=\"Monday\")+1)+$A23*7-6","v":"2021-06-21"},"2021-06-22","2021-06-23","2021-06-24","2021-06-25","2021-06-26","2021-06-27"]
[5,{"$f":"Days+DATE(CalYear,MONTH(May_Val),1)-WEEKDAY(DATE(CalYear,MONTH(May_Val),1),(WeekStart=\"Monday\")+1)+$A24*7-6","v":"2021-05-24"},"2021-05-25","2021-05-26","2021-05-27","2021-05-28","2021-05-29","2021-05-30",null,{"$f":"Days+DATE(CalYear,MONTH(June_Val),1)-WEEKDAY(DATE(CalYear,MONTH(June_Val),1),(WeekStart=\"Monday\")+1)+$A24*7-6","v":"2021-06-28"},"2021-06-29","2021-06-30","2021-07-01","2021-07-02","2021-07-03","2021-07-04"]
[6,{"$f":"Days+DATE(CalYear,MONTH(May_Val),1)-WEEKDAY(DATE(CalYear,MONTH(May_Val),1),(WeekStart=\"Monday\")+1)+$A25*7-6","v":"2021-05-31"},"2021-06-01","2021-06-02","2021-06-03","2021-06-04","2021-06-05","2021-06-06",null,{"$f":"Days+DATE(CalYear,MONTH(June_Val),1)-WEEKDAY(DATE(CalYear,MONTH(June_Val),1),(WeekStart=\"Monday\")+1)+$A25*7-6","v":"2021-07-05"},"2021-07-06","2021-07-07","2021-07-08","2021-07-09","2021-07-10","2021-07-11"]
[null,{"$f":"UPPER(TEXT(July_Val,\"MMMM\"))","v":"LUGLIO"},{"$nulls":7},{"$f":"UPPER(TEXT(Aug_Val,\"MMMM\"))","v":"AGOSTO"}]
[null,{"$f":"CHOOSE(1+(WeekStart=\"Monday\"),\"Dom\",\"Lun\",\"Mar\",\"Mer\",\"Gio\",\"Ven\",\"Sab\",\"Dom\")","v":"Lun"},{"$f":"CHOOSE(2+(WeekStart=\"Monday\"),\"Dom\",\"Lun\",\"Mar\",\"Mer\",\"Gio\",\"Ven\",\"Sab\",\"Dom\")","v":"Mar"},{"$f":"CHOOSE(3+(WeekStart=\"Monday\"),\"Dom\",\"Lun\",\"Mar\",\"Mer\",\"Gio\",\"Ven\",\"Sab\",\"Dom\")","v":"Mer"},{"$f":"CHOOSE(4+(WeekStart=\"Monday\"),\"Dom\",\"Lun\",\"Mar\",\"Mer\",\"Gio\",\"Ven\",\"Sab\",\"Dom\")","v":"Gio"},{"$f":"CHOOSE(5+(WeekStart=\"Monday\"),\"Dom\",\"Lun\",\"Mar\",\"Mer\",\"Gio\",\"Ven\",\"Sab\",\"Dom\")","v":"Ven"},{"$f":"CHOOSE(6+(WeekStart=\"Monday\"),\"Dom\",\"Lun\",\"Mar\",\"Mer\",\"Gio\",\"Ven\",\"Sab\",\"Dom\")","v":"Sab"},{"$f":"CHOOSE(7+(WeekStart=\"Monday\"),\"Dom\",\"Lun\",\"Mar\",\"Mer\",\"Gio\",\"Ven\",\"Sab\",\"Dom\")","v":"Dom"},null,{"$f":"CHOOSE(1+(WeekStart=\"Monday\"),\"Dom\",\"Lun\",\"Mar\",\"Mer\",\"Gio\",\"Ven\",\"Sab\",\"Dom\")","v":"Lun"},{"$f":"CHOOSE(2+(WeekStart=\"Monday\"),\"Dom\",\"Lun\",\"Mar\",\"Mer\",\"Gio\",\"Ven\",\"Sab\",\"Dom\")","v":"Mar"},{"$f":"CHOOSE(3+(WeekStart=\"Monday\"),\"Dom\",\"Lun\",\"Mar\",\"Mer\",\"Gio\",\"Ven\",\"Sab\",\"Dom\")","v":"Mer"},{"$f":"CHOOSE(4+(WeekStart=\"Monday\"),\"Dom\",\"Lun\",\"Mar\",\"Mer\",\"Gio\",\"Ven\",\"Sab\",\"Dom\")","v":"Gio"},{"$f":"CHOOSE(5+(WeekStart=\"Monday\"),\"Dom\",\"Lun\",\"Mar\",\"Mer\",\"Gio\",\"Ven\",\"Sab\",\"Dom\")","v":"Ven"},{"$f":"CHOOSE(6+(WeekStart=\"Monday\"),\"Dom\",\"Lun\",\"Mar\",\"Mer\",\"Gio\",\"Ven\",\"Sab\",\"Dom\")","v":"Sab"},{"$f":"CHOOSE(7+(WeekStart=\"Monday\"),\"Dom\",\"Lun\",\"Mar\",\"Mer\",\"Gio\",\"Ven\",\"Sab\",\"Dom\")","v":"Dom"}]
[null,{"$f":"Days+DATE(CalYear,MONTH(July_Val),1)-WEEKDAY(DATE(CalYear,MONTH(July_Val),1),(WeekStart=\"Monday\")+1)+$A20*7-6","v":"2021-06-28"},"2021-06-29","2021-06-30","2021-07-01","2021-07-02","2021-07-03","2021-07-04",null,{"$f":"Days+DATE(CalYear,MONTH(Aug_Val),1)-WEEKDAY(DATE(CalYear,MONTH(Aug_Val),1),(WeekStart=\"Monday\")+1)+$A20*7-6","v":"2021-07-26"},"2021-07-27","2021-07-28","2021-07-29","2021-07-30","2021-07-31","2021-08-01"]
[null,{"$f":"Days+DATE(CalYear,MONTH(July_Val),1)-WEEKDAY(DATE(CalYear,MONTH(July_Val),1),(WeekStart=\"Monday\")+1)+$A21*7-6","v":"2021-07-05"},"2021-07-06","2021-07-07","2021-07-08","2021-07-09","2021-07-10","2021-07-11",null,{"$f":"Days+DATE(CalYear,MONTH(Aug_Val),1)-WEEKDAY(DATE(CalYear,MONTH(Aug_Val),1),(WeekStart=\"Monday\")+1)+$A21*7-6","v":"2021-08-02"},"2021-08-03","2021-08-04","2021-08-05","2021-08-06","2021-08-07","2021-08-08"]
[null,{"$f":"Days+DATE(CalYear,MONTH(July_Val),1)-WEEKDAY(DATE(CalYear,MONTH(July_Val),1),(WeekStart=\"Monday\")+1)+$A22*7-6","v":"2021-07-12"},"2021-07-13","2021-07-14","2021-07-15","2021-07-16","2021-07-17","2021-07-18",null,{"$f":"Days+DATE(CalYear,MONTH(Aug_Val),1)-WEEKDAY(DATE(CalYear,MONTH(Aug_Val),1),(WeekStart=\"Monday\")+1)+$A22*7-6","v":"2021-08-09"},"2021-08-10","2021-08-11","2021-08-12","2021-08-13","2021-08-14","2021-08-15"]
[null,{"$f":"Days+DATE(CalYear,MONTH(July_Val),1)-WEEKDAY(DATE(CalYear,MONTH(July_Val),1),(WeekStart=\"Monday\")+1)+$A23*7-6","v":"2021-07-19"},"2021-07-20","2021-07-21","2021-07-22","2021-07-23","2021-07-24","2021-07-25",null,{"$f":"Days+DATE(CalYear,MONTH(Aug_Val),1)-WEEKDAY(DATE(CalYear,MONTH(Aug_Val),1),(WeekStart=\"Monday\")+1)+$A23*7-6","v":"2021-08-16"},"2021-08-17","2021-08-18","2021-08-19","2021-08-20","2021-08-21","2021-08-22"]
[null,{"$f":"Days+DATE(CalYear,MONTH(July_Val),1)-WEEKDAY(DATE(CalYear,MONTH(July_Val),1),(WeekStart=\"Monday\")+1)+$A24*7-6","v":"2021-07-26"},"2021-07-27","2021-07-28","2021-07-29","2021-07-30","2021-07-31","2021-08-01",null,{"$f":"Days+DATE(CalYear,MONTH(Aug_Val),1)-WEEKDAY(DATE(CalYear,MONTH(Aug_Val),1),(WeekStart=\"Monday\")+1)+$A24*7-6","v":"2021-08-23"},"2021-08-24","2021-08-25","2021-08-26","2021-08-27","2021-08-28","2021-08-29"]
[null,{"$f":"Days+DATE(CalYear,MONTH(July_Val),1)-WEEKDAY(DATE(CalYear,MONTH(July_Val),1),(WeekStart=\"Monday\")+1)+$A25*7-6","v":"2021-08-02"},"2021-08-03","2021-08-04","2021-08-05","2021-08-06","2021-08-07","2021-08-08",null,{"$f":"Days+DATE(CalYear,MONTH(Aug_Val),1)-WEEKDAY(DATE(CalYear,MONTH(Aug_Val),1),(WeekStart=\"Monday\")+1)+$A25*7-6","v":"2021-08-30"},"2021-08-31","2021-09-01","2021-09-02","2021-09-03","2021-09-04","2021-09-05"]
[null,{"$f":"UPPER(TEXT(Sep_Val,\"MMMM\"))","v":"SETTEMBRE"},{"$nulls":7},{"$f":"UPPER(TEXT(Oct_Val,\"MMMM\"))","v":"OTTOBRE"}]
[null,{"$f":"CHOOSE(1+(WeekStart=\"Monday\"),\"Dom\",\"Lun\",\"Mar\",\"Mer\",\"Gio\",\"Ven\",\"Sab\",\"Dom\")","v":"Lun"},{"$f":"CHOOSE(2+(WeekStart=\"Monday\"),\"Dom\",\"Lun\",\"Mar\",\"Mer\",\"Gio\",\"Ven\",\"Sab\",\"Dom\")","v":"Mar"},{"$f":"CHOOSE(3+(WeekStart=\"Monday\"),\"Dom\",\"Lun\",\"Mar\",\"Mer\",\"Gio\",\"Ven\",\"Sab\",\"Dom\")","v":"Mer"},{"$f":"CHOOSE(4+(WeekStart=\"Monday\"),\"Dom\",\"Lun\",\"Mar\",\"Mer\",\"Gio\",\"Ven\",\"Sab\",\"Dom\")","v":"Gio"},{"$f":"CHOOSE(5+(WeekStart=\"Monday\"),\"Dom\",\"Lun\",\"Mar\",\"Mer\",\"Gio\",\"Ven\",\"Sab\",\"Dom\")","v":"Ven"},{"$f":"CHOOSE(6+(WeekStart=\"Monday\"),\"Dom\",\"Lun\",\"Mar\",\"Mer\",\"Gio\",\"Ven\",\"Sab\",\"Dom\")","v":"Sab"},{"$f":"CHOOSE(7+(WeekStart=\"Monday\"),\"Dom\",\"Lun\",\"Mar\",\"Mer\",\"Gio\",\"Ven\",\"Sab\",\"Dom\")","v":"Dom"},null,{"$f":"CHOOSE(1+(WeekStart=\"Monday\"),\"Dom\",\"Lun\",\"Mar\",\"Mer\",\"Gio\",\"Ven\",\"Sab\",\"Dom\")","v":"Lun"},{"$f":"CHOOSE(2+(WeekStart=\"Monday\"),\"Dom\",\"Lun\",\"Mar\",\"Mer\",\"Gio\",\"Ven\",\"Sab\",\"Dom\")","v":"Mar"},{"$f":"CHOOSE(3+(WeekStart=\"Monday\"),\"Dom\",\"Lun\",\"Mar\",\"Mer\",\"Gio\",\"Ven\",\"Sab\",\"Dom\")","v":"Mer"},{"$f":"CHOOSE(4+(WeekStart=\"Monday\"),\"Dom\",\"Lun\",\"Mar\",\"Mer\",\"Gio\",\"Ven\",\"Sab\",\"Dom\")","v":"Gio"},{"$f":"CHOOSE(5+(WeekStart=\"Monday\"),\"Dom\",\"Lun\",\"Mar\",\"Mer\",\"Gio\",\"Ven\",\"Sab\",\"Dom\")","v":"Ven"},{"$f":"CHOOSE(6+(WeekStart=\"Monday\"),\"Dom\",\"Lun\",\"Mar\",\"Mer\",\"Gio\",\"Ven\",\"Sab\",\"Dom\")","v":"Sab"},{"$f":"CHOOSE(7+(WeekStart=\"Monday\"),\"Dom\",\"Lun\",\"Mar\",\"Mer\",\"Gio\",\"Ven\",\"Sab\",\"Dom\")","v":"Dom"}]
[1,{"$f":"Days+DATE(CalYear,MONTH(Sep_Val),1)-WEEKDAY(DATE(CalYear,MONTH(Sep_Val),1),(WeekStart=\"Monday\")+1)+$A36*7-6","v":"2021-08-30"},"2021-08-31","2021-09-01","2021-09-02","2021-09-03","2021-09-04","2021-09-05",null,{"$f":"Days+DATE(CalYear,MONTH(Oct_Val),1)-WEEKDAY(DATE(CalYear,MONTH(Oct_Val),1),(WeekStart=\"Monday\")+1)+$A36*7-6","v":"2021-09-27"},"2021-09-28","2021-09-29","2021-09-30","2021-10-01","2021-10-02","2021-10-03"]
[2,{"$f":"Days+DATE(CalYear,MONTH(Sep_Val),1)-WEEKDAY(DATE(CalYear,MONTH(Sep_Val),1),(WeekStart=\"Monday\")+1)+$A37*7-6","v":"2021-09-06"},"2021-09-07","2021-09-08","2021-09-09","2021-09-10","2021-09-11","2021-09-12",null,{"$f":"Days+DATE(CalYear,MONTH(Oct_Val),1)-WEEKDAY(DATE(CalYear,MONTH(Oct_Val),1),(WeekStart=\"Monday\")+1)+$A37*7-6","v":"2021-10-04"},"2021-10-05","2021-10-06","2021-10-07","2021-10-08","2021-10-09","2021-10-10"]
[3,{"$f":"Days+DATE(CalYear,MONTH(Sep_Val),1)-WEEKDAY(DATE(CalYear,MONTH(Sep_Val),1),(WeekStart=\"Monday\")+1)+$A38*7-6","v":"2021-09-13"},"2021-09-14","2021-09-15","2021-09-16","2021-09-17","2021-09-18","2021-09-19",null,{"$f":"Days+DATE(CalYear,MONTH(Oct_Val),1)-WEEKDAY(DATE(CalYear,MONTH(Oct_Val),1),(WeekStart=\"Monday\")+1)+$A38*7-6","v":"2021-10-11"},"2021-10-12","2021-10-13","2021-10-14","2021-10-15","2021-10-16","2021-10-17"]
[4,{"$f":"Days+DATE(CalYear,MONTH(Sep_Val),1)-WEEKDAY(DATE(CalYear,MONTH(Sep_Val),1),(WeekStart=\"Monday\")+1)+$A39*7-6","v":"2021-09-20"},"2021-09-21","2021-09-22","2021-09-23","2021-09-24","2021-09-25","2021-09-26",null,{"$f":"Days+DATE(CalYear,MONTH(Oct_Val),1)-WEEKDAY(DATE(CalYear,MONTH(Oct_Val),1),(WeekStart=\"Monday\")+1)+$A39*7-6","v":"2021-10-18"},"2021-10-19","2021-10-20","2021-10-21","2021-10-22","2021-10-23","2021-10-24"]
[5,{"$f":"Days+DATE(CalYear,MONTH(Sep_Val),1)-WEEKDAY(DATE(CalYear,MONTH(Sep_Val),1),(WeekStart=\"Monday\")+1)+$A40*7-6","v":"2021-09-27"},"2021-09-28","2021-09-29","2021-09-30","2021-10-01","2021-10-02","2021-10-03",null,{"$f":"Days+DATE(CalYear,MONTH(Oct_Val),1)-WEEKDAY(DATE(CalYear,MONTH(Oct_Val),1),(WeekStart=\"Monday\")+1)+$A40*7-6","v":"2021-10-25"},"2021-10-26","2021-10-27","2021-10-28","2021-10-29","2021-10-30","2021-10-31"]
[6,{"$f":"Days+DATE(CalYear,MONTH(Sep_Val),1)-WEEKDAY(DATE(CalYear,MONTH(Sep_Val),1),(WeekStart=\"Monday\")+1)+$A41*7-6","v":"2021-10-04"},"2021-10-05","2021-10-06","2021-10-07","2021-10-08","2021-10-09","2021-10-10",null,{"$f":"Days+DATE(CalYear,MONTH(Oct_Val),1)-WEEKDAY(DATE(CalYear,MONTH(Oct_Val),1),(WeekStart=\"Monday\")+1)+$A41*7-6","v":"2021-11-01"},"2021-11-02","2021-11-03","2021-11-04","2021-11-05","2021-11-06","2021-11-07"]
[null,{"$f":"UPPER(TEXT(Nov_Val,\"MMMM\"))","v":"NOVEMBRE"},{"$nulls":7},{"$f":"UPPER(TEXT(Dec_Val,\"MMMM\"))","v":"DICEMBRE"}]
[null,{"$f":"CHOOSE(1+(WeekStart=\"Monday\"),\"Dom\",\"Lun\",\"Mar\",\"Mer\",\"Gio\",\"Ven\",\"Sab\",\"Dom\")","v":"Lun"},{"$f":"CHOOSE(2+(WeekStart=\"Monday\"),\"Dom\",\"Lun\",\"Mar\",\"Mer\",\"Gio\",\"Ven\",\"Sab\",\"Dom\")","v":"Mar"},{"$f":"CHOOSE(3+(WeekStart=\"Monday\"),\"Dom\",\"Lun\",\"Mar\",\"Mer\",\"Gio\",\"Ven\",\"Sab\",\"Dom\")","v":"Mer"},{"$f":"CHOOSE(4+(WeekStart=\"Monday\"),\"Dom\",\"Lun\",\"Mar\",\"Mer\",\"Gio\",\"Ven\",\"Sab\",\"Dom\")","v":"Gio"},{"$f":"CHOOSE(5+(WeekStart=\"Monday\"),\"Dom\",\"Lun\",\"Mar\",\"Mer\",\"Gio\",\"Ven\",\"Sab\",\"Dom\")","v":"Ven"},{"$f":"CHOOSE(6+(WeekStart=\"Monday\"),\"Dom\",\"Lun\",\"Mar\",\"Mer\",\"Gio\",\"Ven\",\"Sab\",\"Dom\")","v":"Sab"},{"$f":"CHOOSE(7+(WeekStart=\"Monday\"),\"Dom\",\"Lun\",\"Mar\",\"Mer\",\"Gio\",\"Ven\",\"Sab\",\"Dom\")","v":"Dom"},null,{"$f":"CHOOSE(1+(WeekStart=\"Monday\"),\"Dom\",\"Lun\",\"Mar\",\"Mer\",\"Gio\",\"Ven\",\"Sab\",\"Dom\")","v":"Lun"},{"$f":"CHOOSE(2+(WeekStart=\"Monday\"),\"Dom\",\"Lun\",\"Mar\",\"Mer\",\"Gio\",\"Ven\",\"Sab\",\"Dom\")","v":"Mar"},{"$f":"CHOOSE(3+(WeekStart=\"Monday\"),\"Dom\",\"Lun\",\"Mar\",\"Mer\",\"Gio\",\"Ven\",\"Sab\",\"Dom\")","v":"Mer"},{"$f":"CHOOSE(4+(WeekStart=\"Monday\"),\"Dom\",\"Lun\",\"Mar\",\"Mer\",\"Gio\",\"Ven\",\"Sab\",\"Dom\")","v":"Gio"},{"$f":"CHOOSE(5+(WeekStart=\"Monday\"),\"Dom\",\"Lun\",\"Mar\",\"Mer\",\"Gio\",\"Ven\",\"Sab\",\"Dom\")","v":"Ven"},{"$f":"CHOOSE(6+(WeekStart=\"Monday\"),\"Dom\",\"Lun\",\"Mar\",\"Mer\",\"Gio\",\"Ven\",\"Sab\",\"Dom\")","v":"Sab"},{"$f":"CHOOSE(7+(WeekStart=\"Monday\"),\"Dom\",\"Lun\",\"Mar\",\"Mer\",\"Gio\",\"Ven\",\"Sab\",\"Dom\")","v":"Dom"}]
[null,{"$f":"Days+DATE(CalYear,MONTH(Nov_Val),1)-WEEKDAY(DATE(CalYear,MONTH(Nov_Val),1),(WeekStart=\"Monday\")+1)+$A36*7-6","v":"2021-11-01"},"2021-11-02","2021-11-03","2021-11-04","2021-11-05","2021-11-06","2021-11-07",null,{"$f":"Days+DATE(CalYear,MONTH(Dec_Val),1)-WEEKDAY(DATE(CalYear,MONTH(Dec_Val),1),(WeekStart=\"Monday\")+1)+$A36*7-6","v":"2021-11-29"},"2021-11-30","2021-12-01","2021-12-02","2021-12-03","2021-12-04","2021-12-05"]
[null,{"$f":"Days+DATE(CalYear,MONTH(Nov_Val),1)-WEEKDAY(DATE(CalYear,MONTH(Nov_Val),1),(WeekStart=\"Monday\")+1)+$A37*7-6","v":"2021-11-08"},"2021-11-09","2021-11-10","2021-11-11","2021-11-12","2021-11-13","2021-11-14",null,{"$f":"Days+DATE(CalYear,MONTH(Dec_Val),1)-WEEKDAY(DATE(CalYear,MONTH(Dec_Val),1),(WeekStart=\"Monday\")+1)+$A37*7-6","v":"2021-12-06"},"2021-12-07","2021-12-08","2021-12-09","2021-12-10","2021-12-11","2021-12-12"]
[null,{"$f":"Days+DATE(CalYear,MONTH(Nov_Val),1)-WEEKDAY(DATE(CalYear,MONTH(Nov_Val),1),(WeekStart=\"Monday\")+1)+$A38*7-6","v":"2021-11-15"},"2021-11-16","2021-11-17","2021-11-18","2021-11-19","2021-11-20","2021-11-21",null,{"$f":"Days+DATE(CalYear,MONTH(Dec_Val),1)-WEEKDAY(DATE(CalYear,MONTH(Dec_Val),1),(WeekStart=\"Monday\")+1)+$A38*7-6","v":"2021-12-13"},"2021-12-14","2021-12-15","2021-12-16","2021-12-17","2021-12-18","2021-12-19"]
[null,{"$f":"Days+DATE(CalYear,MONTH(Nov_Val),1)-WEEKDAY(DATE(CalYear,MONTH(Nov_Val),1),(WeekStart=\"Monday\")+1)+$A39*7-6","v":"2021-11-22"},"2021-11-23","2021-11-24","2021-11-25","2021-11-26","2021-11-27","2021-11-28",null,{"$f":"Days+DATE(CalYear,MONTH(Dec_Val),1)-WEEKDAY(DATE(CalYear,MONTH(Dec_Val),1),(WeekStart=\"Monday\")+1)+$A39*7-6","v":"2021-12-20"},"2021-12-21","2021-12-22","2021-12-23","2021-12-24","2021-12-25","2021-12-26"]
[null,{"$f":"Days+DATE(CalYear,MONTH(Nov_Val),1)-WEEKDAY(DATE(CalYear,MONTH(Nov_Val),1),(WeekStart=\"Monday\")+1)+$A40*7-6","v":"2021-11-29"},"2021-11-30","2021-12-01","2021-12-02","2021-12-03","2021-12-04","2021-12-05",null,{"$f":"Days+DATE(CalYear,MONTH(Dec_Val),1)-WEEKDAY(DATE(CalYear,MONTH(Dec_Val),1),(WeekStart=\"Monday\")+1)+$A40*7-6","v":"2021-12-27"},"2021-12-28","2021-12-29","2021-12-30","2021-12-31","2022-01-01","2022-01-02"]
[null,{"$f":"Days+DATE(CalYear,MONTH(Nov_Val),1)-WEEKDAY(DATE(CalYear,MONTH(Nov_Val),1),(WeekStart=\"Monday\")+1)+$A41*7-6","v":"2021-12-06"},"2021-12-07","2021-12-08","2021-12-09","2021-12-10","2021-12-11","2021-12-12",null,{"$f":"Days+DATE(CalYear,MONTH(Dec_Val),1)-WEEKDAY(DATE(CalYear,MONTH(Dec_Val),1),(WeekStart=\"Monday\")+1)+$A41*7-6","v":"2022-01-03"},"2022-01-04","2022-01-05","2022-01-06","2022-01-07","2022-01-08","2022-01-09"]

{"sheet":"CALENDARIO 2022","index":2,"n_rows":49,"n_cols":16,"rows_kept":49,"merged":[[0,1,0,15],[1,1,1,7],[1,9,1,15],[9,1,9,7],[9,9,9,15],[17,1,17,7],[17,9,17,15],[25,1,25,7],[25,9,25,15],[33,1,33,7],[33,9,33,15],[41,1,41,7],[41,9,41,15]]}
[null,{"$f":"YEAR(TODAY())+2","v":2022}]
[null,{"$f":"UPPER(TEXT(Jan_Val,\"MMMM\"))","v":"GENNAIO"},{"$nulls":7},{"$f":"UPPER(TEXT(Feb_Val,\"MMMM\"))","v":"FEBBRAIO"}]
[null,{"$f":"CHOOSE(1+(WeekStart=\"Monday\"),\"Dom\",\"Lun\",\"Mar\",\"Mer\",\"Gio\",\"Ven\",\"Sab\",\"Dom\")","v":"Lun"},{"$f":"CHOOSE(2+(WeekStart=\"Monday\"),\"Dom\",\"Lun\",\"Mar\",\"Mer\",\"Gio\",\"Ven\",\"Sab\",\"Dom\")","v":"Mar"},{"$f":"CHOOSE(3+(WeekStart=\"Monday\"),\"Dom\",\"Lun\",\"Mar\",\"Mer\",\"Gio\",\"Ven\",\"Sab\",\"Dom\")","v":"Mer"},{"$f":"CHOOSE(4+(WeekStart=\"Monday\"),\"Dom\",\"Lun\",\"Mar\",\"Mer\",\"Gio\",\"Ven\",\"Sab\",\"Dom\")","v":"Gio"},{"$f":"CHOOSE(5+(WeekStart=\"Monday\"),\"Dom\",\"Lun\",\"Mar\",\"Mer\",\"Gio\",\"Ven\",\"Sab\",\"Dom\")","v":"Ven"},{"$f":"CHOOSE(6+(WeekStart=\"Monday\"),\"Dom\",\"Lun\",\"Mar\",\"Mer\",\"Gio\",\"Ven\",\"Sab\",\"Dom\")","v":"Sab"},{"$f":"CHOOSE(7+(WeekStart=\"Monday\"),\"Dom\",\"Lun\",\"Mar\",\"Mer\",\"Gio\",\"Ven\",\"Sab\",\"Dom\")","v":"Dom"},null,{"$f":"CHOOSE(1+(WeekStart=\"Monday\"),\"Dom\",\"Lun\",\"Mar\",\"Mer\",\"Gio\",\"Ven\",\"Sab\",\"Dom\")","v":"Lun"},{"$f":"CHOOSE(2+(WeekStart=\"Monday\"),\"Dom\",\"Lun\",\"Mar\",\"Mer\",\"Gio\",\"Ven\",\"Sab\",\"Dom\")","v":"Mar"},{"$f":"CHOOSE(3+(WeekStart=\"Monday\"),\"Dom\",\"Lun\",\"Mar\",\"Mer\",\"Gio\",\"Ven\",\"Sab\",\"Dom\")","v":"Mer"},{"$f":"CHOOSE(4+(WeekStart=\"Monday\"),\"Dom\",\"Lun\",\"Mar\",\"Mer\",\"Gio\",\"Ven\",\"Sab\",\"Dom\")","v":"Gio"},{"$f":"CHOOSE(5+(WeekStart=\"Monday\"),\"Dom\",\"Lun\",\"Mar\",\"Mer\",\"Gio\",\"Ven\",\"Sab\",\"Dom\")","v":"Ven"},{"$f":"CHOOSE(6+(WeekStart=\"Monday\"),\"Dom\",\"Lun\",\"Mar\",\"Mer\",\"Gio\",\"Ven\",\"Sab\",\"Dom\")","v":"Sab"},{"$f":"CHOOSE(7+(WeekStart=\"Monday\"),\"Dom\",\"Lun\",\"Mar\",\"Mer\",\"Gio\",\"Ven\",\"Sab\",\"Dom\")","v":"Dom"}]
[1,{"$f":"Days+DATE(CalYear,MONTH(Jan_Val),1)-WEEKDAY(DATE(CalYear,MONTH(Jan_Val),1),(WeekStart=\"Monday\")+1)+$A4*7-6","v":"2021-12-27"},"2021-12-28","2021-12-29","2021-12-30","2021-12-31","2022-01-01","2022-01-02",null,{"$f":"Days+DATE(CalYear,MONTH(Feb_Val),1)-WEEKDAY(DATE(CalYear,MONTH(Feb_Val),1),(WeekStart=\"Monday\")+1)+$A4*7-6","v":"2022-01-31"},"2022-02-01","2022-02-02","2022-02-03","2022-02-04","2022-02-05","2022-02-06"]
[2,{"$f":"Days+DATE(CalYear,MONTH(Jan_Val),1)-WEEKDAY(DATE(CalYear,MONTH(Jan_Val),1),(WeekStart=\"Monday\")+1)+$A5*7-6","v":"2022-01-03"},"2022-01-04","2022-01-05","2022-01-06","2022-01-07","2022-01-08","2022-01-09",null,{"$f":"Days+DATE(CalYear,MONTH(Feb_Val),1)-WEEKDAY(DATE(CalYear,MONTH(Feb_Val),1),(WeekStart=\"Monday\")+1)+$A5*7-6","v":"2022-02-07"},"2022-02-08","2022-02-09","2022-02-10","2022-02-11","2022-02-12","2022-02-13"]
[3,{"$f":"Days+DATE(CalYear,MONTH(Jan_Val),1)-WEEKDAY(DATE(CalYear,MONTH(Jan_Val),1),(WeekStart=\"Monday\")+1)+$A6*7-6","v":"2022-01-10"},"2022-01-11","2022-01-12","2022-01-13","2022-01-14","2022-01-15","2022-01-16",null,{"$f":"Days+DATE(CalYear,MONTH(Feb_Val),1)-WEEKDAY(DATE(CalYear,MONTH(Feb_Val),1),(WeekStart=\"Monday\")+1)+$A6*7-6","v":"2022-02-14"},"2022-02-15","2022-02-16","2022-02-17","2022-02-18","2022-02-19","2022-02-20"]
[4,{"$f":"Days+DATE(CalYear,MONTH(Jan_Val),1)-WEEKDAY(DATE(CalYear,MONTH(Jan_Val),1),(WeekStart=\"Monday\")+1)+$A7*7-6","v":"2022-01-17"},"2022-01-18","2022-01-19","2022-01-20","2022-01-21","2022-01-22","2022-01-23",null,{"$f":"Days+DATE(CalYear,MONTH(Feb_Val),1)-WEEKDAY(DATE(CalYear,MONTH(Feb_Val),1),(WeekStart=\"Monday\")+1)+$A7*7-6","v":"2022-02-21"},"2022-02-22","2022-02-23","2022-02-24","2022-02-25","2022-02-26","2022-02-27"]
[5,{"$f":"Days+DATE(CalYear,MONTH(Jan_Val),1)-WEEKDAY(DATE(CalYear,MONTH(Jan_Val),1),(WeekStart=\"Monday\")+1)+$A8*7-6","v":"2022-01-24"},"2022-01-25","2022-01-26","2022-01-27","2022-01-28","2022-01-29","2022-01-30",null,{"$f":"Days+DATE(CalYear,MONTH(Feb_Val),1)-WEEKDAY(DATE(CalYear,MONTH(Feb_Val),1),(WeekStart=\"Monday\")+1)+$A8*7-6","v":"2022-02-28"},"2022-03-01","2022-03-02","2022-03-03","2022-03-04","2022-03-05","2022-03-06"]
[6,{"$f":"Days+DATE(CalYear,MONTH(Jan_Val),1)-WEEKDAY(DATE(CalYear,MONTH(Jan_Val),1),(WeekStart=\"Monday\")+1)+$A9*7-6","v":"2022-01-31"},"2022-02-01","2022-02-02","2022-02-03","2022-02-04","2022-02-05","2022-02-06",null,{"$f":"Days+DATE(CalYear,MONTH(Feb_Val),1)-WEEKDAY(DATE(CalYear,MONTH(Feb_Val),1),(WeekStart=\"Monday\")+1)+$A9*7-6","v":"2022-03-07"},"2022-03-08","2022-03-09","2022-03-10","2022-03-11","2022-03-12","2022-03-13"]
[null,{"$f":"UPPER(TEXT(Mar_Val,\"MMMM\"))","v":"MARZO"},{"$nulls":7},{"$f":"UPPER(TEXT(Apl_Val,\"MMMM\"))","v":"APRILE"}]
[null,{"$f":"CHOOSE(1+(WeekStart=\"Monday\"),\"Dom\",\"Lun\",\"Mar\",\"Mer\",\"Gio\",\"Ven\",\"Sab\",\"Dom\")","v":"Lun"},{"$f":"CHOOSE(2+(WeekStart=\"Monday\"),\"Dom\",\"Lun\",\"Mar\",\"Mer\",\"Gio\",\"Ven\",\"Sab\",\"Dom\")","v":"Mar"},{"$f":"CHOOSE(3+(WeekStart=\"Monday\"),\"Dom\",\"Lun\",\"Mar\",\"Mer\",\"Gio\",\"Ven\",\"Sab\",\"Dom\")","v":"Mer"},{"$f":"CHOOSE(4+(WeekStart=\"Monday\"),\"Dom\",\"Lun\",\"Mar\",\"Mer\",\"Gio\",\"Ven\",\"Sab\",\"Dom\")","v":"Gio"},{"$f":"CHOOSE(5+(WeekStart=\"Monday\"),\"Dom\",\"Lun\",\"Mar\",\"Mer\",\"Gio\",\"Ven\",\"Sab\",\"Dom\")","v":"Ven"},{"$f":"CHOOSE(6+(WeekStart=\"Monday\"),\"Dom\",\"Lun\",\"Mar\",\"Mer\",\"Gio\",\"Ven\",\"Sab\",\"Dom\")","v":"Sab"},{"$f":"CHOOSE(7+(WeekStart=\"Monday\"),\"Dom\",\"Lun\",\"Mar\",\"Mer\",\"Gio\",\"Ven\",\"Sab\",\"Dom\")","v":"Dom"},null,{"$f":"CHOOSE(1+(WeekStart=\"Monday\"),\"Dom\",\"Lun\",\"Mar\",\"Mer\",\"Gio\",\"Ven\",\"Sab\",\"Dom\")","v":"Lun"},{"$f":"CHOOSE(2+(WeekStart=\"Monday\"),\"Dom\",\"Lun\",\"Mar\",\"Mer\",\"Gio\",\"Ven\",\"Sab\",\"Dom\")","v":"Mar"},{"$f":"CHOOSE(3+(WeekStart=\"Monday\"),\"Dom\",\"Lun\",\"Mar\",\"Mer\",\"Gio\",\"Ven\",\"Sab\",\"Dom\")","v":"Mer"},{"$f":"CHOOSE(4+(WeekStart=\"Monday\"),\"Dom\",\"Lun\",\"Mar\",\"Mer\",\"Gio\",\"Ven\",\"Sab\",\"Dom\")","v":"Gio"},{"$f":"CHOOSE(5+(WeekStart=\"Monday\"),\"Dom\",\"Lun\",\"Mar\",\"Mer\",\"Gio\",\"Ven\",\"Sab\",\"Dom\")","v":"Ven"},{"$f":"CHOOSE(6+(WeekStart=\"Monday\"),\"Dom\",\"Lun\",\"Mar\",\"Mer\",\"Gio\",\"Ven\",\"Sab\",\"Dom\")","v":"Sab"},{"$f":"CHOOSE(7+(WeekStart=\"Monday\"),\"Dom\",\"Lun\",\"Mar\",\"Mer\",\"Gio\",\"Ven\",\"Sab\",\"Dom\")","v":"Dom"}]
[null,{"$f":"Days+DATE(CalYear,MONTH(Mar_Val),1)-WEEKDAY(DATE(CalYear,MONTH(Mar_Val),1),(WeekStart=\"Monday\")+1)+$A4*7-6","v":"2022-02-28"},"2022-03-01","2022-03-02","2022-03-03","2022-03-04","2022-03-05","2022-03-06",null,{"$f":"Days+DATE(CalYear,MONTH(Apl_Val),1)-WEEKDAY(DATE(CalYear,MONTH(Apl_Val),1),(WeekStart=\"Monday\")+1)+$A4*7-6","v":"2022-03-28"},"2022-03-29","2022-03-30","2022-03-31","2022-04-01","2022-04-02","2022-04-03"]
[null,{"$f":"Days+DATE(CalYear,MONTH(Mar_Val),1)-WEEKDAY(DATE(CalYear,MONTH(Mar_Val),1),(WeekStart=\"Monday\")+1)+$A5*7-6","v":"2022-03-07"},"2022-03-08","2022-03-09","2022-03-10","2022-03-11","2022-03-12","2022-03-13",null,{"$f":"Days+DATE(CalYear,MONTH(Apl_Val),1)-WEEKDAY(DATE(CalYear,MONTH(Apl_Val),1),(WeekStart=\"Monday\")+1)+$A5*7-6","v":"2022-04-04"},"2022-04-05","2022-04-06","2022-04-07","2022-04-08","2022-04-09","2022-04-10"]
[null,{"$f":"Days+DATE(CalYear,MONTH(Mar_Val),1)-WEEKDAY(DATE(CalYear,MONTH(Mar_Val),1),(WeekStart=\"Monday\")+1)+$A6*7-6","v":"2022-03-14"},"2022-03-15","2022-03-16","2022-03-17","2022-03-18","2022-03-19","2022-03-20",null,{"$f":"Days+DATE(CalYear,MONTH(Apl_Val),1)-WEEKDAY(DATE(CalYear,MONTH(Apl_Val),1),(WeekStart=\"Monday\")+1)+$A6*7-6","v":"2022-04-11"},"2022-04-12","2022-04-13","2022-04-14","2022-04-15","2022-04-16","2022-04-17"]
[null,{"$f":"Days+DATE(CalYear,MONTH(Mar_Val),1)-WEEKDAY(DATE(CalYear,MONTH(Mar_Val),1),(WeekStart=\"Monday\")+1)+$A7*7-6","v":"2022-03-21"},"2022-03-22","2022-03-23","2022-03-24","2022-03-25","2022-03-26","2022-03-27",null,{"$f":"Days+DATE(CalYear,MONTH(Apl_Val),1)-WEEKDAY(DATE(CalYear,MONTH(Apl_Val),1),(WeekStart=\"Monday\")+1)+$A7*7-6","v":"2022-04-18"},"2022-04-19","2022-04-20","2022-04-21","2022-04-22","2022-04-23","2022-04-24"]
[null,{"$f":"Days+DATE(CalYear,MONTH(Mar_Val),1)-WEEKDAY(DATE(CalYear,MONTH(Mar_Val),1),(WeekStart=\"Monday\")+1)+$A8*7-6","v":"2022-03-28"},"2022-03-29","2022-03-30","2022-03-31","2022-04-01","2022-04-02","2022-04-03",null,{"$f":"Days+DATE(CalYear,MONTH(Apl_Val),1)-WEEKDAY(DATE(CalYear,MONTH(Apl_Val),1),(WeekStart=\"Monday\")+1)+$A8*7-6","v":"2022-04-25"},"2022-04-26","2022-04-27","2022-04-28","2022-04-29","2022-04-30","2022-05-01"]
[null,{"$f":"Days+DATE(CalYear,MONTH(Mar_Val),1)-WEEKDAY(DATE(CalYear,MONTH(Mar_Val),1),(WeekStart=\"Monday\")+1)+$A9*7-6","v":"2022-04-04"},"2022-04-05","2022-04-06","2022-04-07","2022-04-08","2022-04-09","2022-04-10",null,{"$f":"Days+DATE(CalYear,MONTH(Apl_Val),1)-WEEKDAY(DATE(CalYear,MONTH(Apl_Val),1),(WeekStart=\"Monday\")+1)+$A9*7-6","v":"2022-05-02"},"2022-05-03","2022-05-04","2022-05-05","2022-05-06","2022-05-07","2022-05-08"]
[null,{"$f":"UPPER(TEXT(May_Val,\"MMMM\"))","v":"MAGGIO"},{"$nulls":7},{"$f":"UPPER(TEXT(June_Val,\"MMMM\"))","v":"GIUGNO"}]
[null,{"$f":"CHOOSE(1+(WeekStart=\"Monday\"),\"Dom\",\"Lun\",\"Mar\",\"Mer\",\"Gio\",\"Ven\",\"Sab\",\"Dom\")","v":"Lun"},{"$f":"CHOOSE(2+(WeekStart=\"Monday\"),\"Dom\",\"Lun\",\"Mar\",\"Mer\",\"Gio\",\"Ven\",\"Sab\",\"Dom\")","v":"Mar"},{"$f":"CHOOSE(3+(WeekStart=\"Monday\"),\"Dom\",\"Lun\",\"Mar\",\"Mer\",\"Gio\",\"Ven\",\"Sab\",\"Dom\")","v":"Mer"},{"$f":"CHOOSE(4+(WeekStart=\"Monday\"),\"Dom\",\"Lun\",\"Mar\",\"Mer\",\"Gio\",\"Ven\",\"Sab\",\"Dom\")","v":"Gio"},{"$f":"CHOOSE(5+(WeekStart=\"Monday\"),\"Dom\",\"Lun\",\"Mar\",\"Mer\",\"Gio\",\"Ven\",\"Sab\",\"Dom\")","v":"Ven"},{"$f":"CHOOSE(6+(WeekStart=\"Monday\"),\"Dom\",\"Lun\",\"Mar\",\"Mer\",\"Gio\",\"Ven\",\"Sab\",\"Dom\")","v":"Sab"},{"$f":"CHOOSE(7+(WeekStart=\"Monday\"),\"Dom\",\"Lun\",\"Mar\",\"Mer\",\"Gio\",\"Ven\",\"Sab\",\"Dom\")","v":"Dom"},null,{"$f":"CHOOSE(1+(WeekStart=\"Monday\"),\"Dom\",\"Lun\",\"Mar\",\"Mer\",\"Gio\",\"Ven\",\"Sab\",\"Dom\")","v":"Lun"},{"$f":"CHOOSE(2+(WeekStart=\"Monday\"),\"Dom\",\"Lun\",\"Mar\",\"Mer\",\"Gio\",\"Ven\",\"Sab\",\"Dom\")","v":"Mar"},{"$f":"CHOOSE(3+(WeekStart=\"Monday\"),\"Dom\",\"Lun\",\"Mar\",\"Mer\",\"Gio\",\"Ven\",\"Sab\",\"Dom\")","v":"Mer"},{"$f":"CHOOSE(4+(WeekStart=\"Monday\"),\"Dom\",\"Lun\",\"Mar\",\"Mer\",\"Gio\",\"Ven\",\"Sab\",\"Dom\")","v":"Gio"},{"$f":"CHOOSE(5+(WeekStart=\"Monday\"),\"Dom\",\"Lun\",\"Mar\",\"Mer\",\"Gio\",\"Ven\",\"Sab\",\"Dom\")","v":"Ven"},{"$f":"CHOOSE(6+(WeekStart=\"Monday\"),\"Dom\",\"Lun\",\"Mar\",\"Mer\",\"Gio\",\"Ven\",\"Sab\",\"Dom\")","v":"Sab"},{"$f":"CHOOSE(7+(WeekStart=\"Monday\"),\"Dom\",\"Lun\",\"Mar\",\"Mer\",\"Gio\",\"Ven\",\"Sab\",\"Dom\")","v":"Dom"}]
[1,{"$f":"Days+DATE(CalYear,MONTH(May_Val),1)-WEEKDAY(DATE(CalYear,MONTH(May_Val),1),(WeekStart=\"Monday\")+1)+$A20*7-6","v":"2022-04-25"},"2022-04-26","2022-04-27","2022-04-28","2022-04-29","2022-04-30","2022-05-01",null,{"$f":"Days+DATE(CalYear,MONTH(June_Val),1)-WEEKDAY(DATE(CalYear,MONTH(June_Val),1),(WeekStart=\"Monday\")+1)+$A20*7-6","v":"2022-05-30"},"2022-05-31","2022-06-01","2022-06-02","2022-06-03","2022-06-04","2022-06-05"]
[2,{"$f":"Days+DATE(CalYear,MONTH(May_Val),1)-WEEKDAY(DATE(CalYear,MONTH(May_Val),1),(WeekStart=\"Monday\")+1)+$A21*7-6","v":"2022-05-02"},"2022-05-03","2022-05-04","2022-05-05","2022-05-06","2022-05-07","2022-05-08",null,{"$f":"Days+DATE(CalYear,MONTH(June_Val),1)-WEEKDAY(DATE(CalYear,MONTH(June_Val),1),(WeekStart=\"Monday\")+1)+$A21*7-6","v":"2022-06-06"},"2022-06-07","2022-06-08","2022-06-09","2022-06-10","2022-06-11","2022-06-12"]
[3,{"$f":"Days+DATE(CalYear,MONTH(May_Val),1)-WEEKDAY(DATE(CalYear,MONTH(May_Val),1),(WeekStart=\"Monday\")+1)+$A22*7-6","v":"2022-05-09"},"2022-05-10","2022-05-11","2022-05-12","2022-05-13","2022-05-14","2022-05-15",null,{"$f":"Days+DATE(CalYear,MONTH(June_Val),1)-WEEKDAY(DATE(CalYear,MONTH(June_Val),1),(WeekStart=\"Monday\")+1)+$A22*7-6","v":"2022-06-13"},"2022-06-14","2022-06-15","2022-06-16","2022-06-17","2022-06-18","2022-06-19"]
[4,{"$f":"Days+DATE(CalYear,MONTH(May_Val),1)-WEEKDAY(DATE(CalYear,MONTH(May_Val),1),(WeekStart=\"Monday\")+1)+$A23*7-6","v":"2022-05-16"},"2022-05-17","2022-05-18","2022-05-19","2022-05-20","2022-05-21","2022-05-22",null,{"$f":"Days+DATE(CalYear,MONTH(June_Val),1)-WEEKDAY(DATE(CalYear,MONTH(June_Val),1),(WeekStart=\"Monday\")+1)+$A23*7-6","v":"2022-06-20"},"2022-06-21","2022-06-22","2022-06-23","2022-06-24","2022-06-25","2022-06-26"]
[5,{"$f":"Days+DATE(CalYear,MONTH(May_Val),1)-WEEKDAY(DATE(CalYear,MONTH(May_Val),1),(WeekStart=\"Monday\")+1)+$A24*7-6","v":"2022-05-23"},"2022-05-24","2022-05-25","2022-05-26","2022-05-27","2022-05-28","2022-05-29",null,{"$f":"Days+DATE(CalYear,MONTH(June_Val),1)-WEEKDAY(DATE(CalYear,MONTH(June_Val),1),(WeekStart=\"Monday\")+1)+$A24*7-6","v":"2022-06-27"},"2022-06-28","2022-06-29","2022-06-30","2022-07-01","2022-07-02","2022-07-03"]
[6,{"$f":"Days+DATE(CalYear,MONTH(May_Val),1)-WEEKDAY(DATE(CalYear,MONTH(May_Val),1),(WeekStart=\"Monday\")+1)+$A25*7-6","v":"2022-05-30"},"2022-05-31","2022-06-01","2022-06-02","2022-06-03","2022-06-04","2022-06-05",null,{"$f":"Days+DATE(CalYear,MONTH(June_Val),1)-WEEKDAY(DATE(CalYear,MONTH(June_Val),1),(WeekStart=\"Monday\")+1)+$A25*7-6","v":"2022-07-04"},"2022-07-05","2022-07-06","2022-07-07","2022-07-08","2022-07-09","2022-07-10"]
[null,{"$f":"UPPER(TEXT(July_Val,\"MMMM\"))","v":"LUGLIO"},{"$nulls":7},{"$f":"UPPER(TEXT(Aug_Val,\"MMMM\"))","v":"AGOSTO"}]
[null,{"$f":"CHOOSE(1+(WeekStart=\"Monday\"),\"Dom\",\"Lun\",\"Mar\",\"Mer\",\"Gio\",\"Ven\",\"Sab\",\"Dom\")","v":"Lun"},{"$f":"CHOOSE(2+(WeekStart=\"Monday\"),\"Dom\",\"Lun\",\"Mar\",\"Mer\",\"Gio\",\"Ven\",\"Sab\",\"Dom\")","v":"Mar"},{"$f":"CHOOSE(3+(WeekStart=\"Monday\"),\"Dom\",\"Lun\",\"Mar\",\"Mer\",\"Gio\",\"Ven\",\"Sab\",\"Dom\")","v":"Mer"},{"$f":"CHOOSE(4+(WeekStart=\"Monday\"),\"Dom\",\"Lun\",\"Mar\",\"Mer\",\"Gio\",\"Ven\",\"Sab\",\"Dom\")","v":"Gio"},{"$f":"CHOOSE(5+(WeekStart=\"Monday\"),\"Dom\",\"Lun\",\"Mar\",\"Mer\",\"Gio\",\"Ven\",\"Sab\",\"Dom\")","v":"Ven"},{"$f":"CHOOSE(6+(WeekStart=\"Monday\"),\"Dom\",\"Lun\",\"Mar\",\"Mer\",\"Gio\",\"Ven\",\"Sab\",\"Dom\")","v":"Sab"},{"$f":"CHOOSE(7+(WeekStart=\"Monday\"),\"Dom\",\"Lun\",\"Mar\",\"Mer\",\"Gio\",\"Ven\",\"Sab\",\"Dom\")","v":"Dom"},null,{"$f":"CHOOSE(1+(WeekStart=\"Monday\"),\"Dom\",\"Lun\",\"Mar\",\"Mer\",\"Gio\",\"Ven\",\"Sab\",\"Dom\")","v":"Lun"},{"$f":"CHOOSE(2+(WeekStart=\"Monday\"),\"Dom\",\"Lun\",\"Mar\",\"Mer\",\"Gio\",\"Ven\",\"Sab\",\"Dom\")","v":"Mar"},{"$f":"CHOOSE(3+(WeekStart=\"Monday\"),\"Dom\",\"Lun\",\"Mar\",\"Mer\",\"Gio\",\"Ven\",\"Sab\",\"Dom\")","v":"Mer"},{"$f":"CHOOSE(4+(WeekStart=\"Monday\"),\"Dom\",\"Lun\",\"Mar\",\"Mer\",\"Gio\",\"Ven\",\"Sab\",\"Dom\")","v":"Gio"},{"$f":"CHOOSE(5+(WeekStart=\"Monday\"),\"Dom\",\"Lun\",\"Mar\",\"Mer\",\"Gio\",\"Ven\",\"Sab\",\"Dom\")","v":"Ven"},{"$f":"CHOOSE(6+(WeekStart=\"Monday\"),\"Dom\",\"Lun\",\"Mar\",\"Mer\",\"Gio\",\"Ven\",\"Sab\",\"Dom\")","v":"Sab"},{"$f":"CHOOSE(7+(WeekStart=\"Monday\"),\"Dom\",\"Lun\",\"Mar\",\"Mer\",\"Gio\",\"Ven\",\"Sab\",\"Dom\")","v":"Dom"}]
[null,{"$f":"Days+DATE(CalYear,MONTH(July_Val),1)-WEEKDAY(DATE(CalYear,MONTH(July_Val),1),(WeekStart=\"Monday\")+1)+$A20*7-6","v":"2022-06-27"},"2022-06-28","2022-06-29","2022-06-30","2022-07-01","2022-07-02","2022-07-03",null,{"$f":"Days+DATE(CalYear,MONTH(Aug_Val),1)-WEEKDAY(DATE(CalYear,MONTH(Aug_Val),1),(WeekStart=\"Monday\")+1)+$A20*7-6","v":"2022-08-01"},"2022-08-02","2022-08-03","2022-08-04","2022-08-05","2022-08-06","2022-08-07"]
[null,{"$f":"Days+DATE(CalYear,MONTH(July_Val),1)-WEEKDAY(DATE(CalYear,MONTH(July_Val),1),(WeekStart=\"Monday\")+1)+$A21*7-6","v":"2022-07-04"},"2022-07-05","2022-07-06","2022-07-07","2022-07-08","2022-07-09","2022-07-10",null,{"$f":"Days+DATE(CalYear,MONTH(Aug_Val),1)-WEEKDAY(DATE(CalYear,MONTH(Aug_Val),1),(WeekStart=\"Monday\")+1)+$A21*7-6","v":"2022-08-08"},"2022-08-09","2022-08-10","2022-08-11","2022-08-12","2022-08-13","2022-08-14"]
[null,{"$f":"Days+DATE(CalYear,MONTH(July_Val),1)-WEEKDAY(DATE(CalYear,MONTH(July_Val),1),(WeekStart=\"Monday\")+1)+$A22*7-6","v":"2022-07-11"},"2022-07-12","2022-07-13","2022-07-14","2022-07-15","2022-07-16","2022-07-17",null,{"$f":"Days+DATE(CalYear,MONTH(Aug_Val),1)-WEEKDAY(DATE(CalYear,MONTH(Aug_Val),1),(WeekStart=\"Monday\")+1)+$A22*7-6","v":"2022-08-15"},"2022-08-16","2022-08-17","2022-08-18","2022-08-19","2022-08-20","2022-08-21"]
[null,{"$f":"Days+DATE(CalYear,MONTH(July_Val),1)-WEEKDAY(DATE(CalYear,MONTH(July_Val),1),(WeekStart=\"Monday\")+1)+$A23*7-6","v":"2022-07-18"},"2022-07-19","2022-07-20","2022-07-21","2022-07-22","2022-07-23","2022-07-24",null,{"$f":"Days+DATE(CalYear,MONTH(Aug_Val),1)-WEEKDAY(DATE(CalYear,MONTH(Aug_Val),1),(WeekStart=\"Monday\")+1)+$A23*7-6","v":"2022-08-22"},"2022-08-23","2022-08-24","2022-08-25","2022-08-26","2022-08-27","2022-08-28"]
[null,{"$f":"Days+DATE(CalYear,MONTH(July_Val),1)-WEEKDAY(DATE(CalYear,MONTH(July_Val),1),(WeekStart=\"Monday\")+1)+$A24*7-6","v":"2022-07-25"},"2022-07-26","2022-07-27","2022-07-28","2022-07-29","2022-07-30","2022-07-31",null,{"$f":"Days+DATE(CalYear,MONTH(Aug_Val),1)-WEEKDAY(DATE(CalYear,MONTH(Aug_Val),1),(WeekStart=\"Monday\")+1)+$A24*7-6","v":"2022-08-29"},"2022-08-30","2022-08-31","2022-09-01","2022-09-02","2022-09-03","2022-09-04"]
[null,{"$f":"Days+DATE(CalYear,MONTH(July_Val),1)-WEEKDAY(DATE(CalYear,MONTH(July_Val),1),(WeekStart=\"Monday\")+1)+$A25*7-6","v":"2022-08-01"},"2022-08-02","2022-08-03","2022-08-04","2022-08-05","2022-08-06","2022-08-07",null,{"$f":"Days+DATE(CalYear,MONTH(Aug_Val),1)-WEEKDAY(DATE(CalYear,MONTH(Aug_Val),1),(WeekStart=\"Monday\")+1)+$A25*7-6","v":"2022-09-05"},"2022-09-06","2022-09-07","2022-09-08","2022-09-09","2022-09-10","2022-09-11"]
[null,{"$f":"UPPER(TEXT(Sep_Val,\"MMMM\"))","v":"SETTEMBRE"},{"$nulls":7},{"$f":"UPPER(TEXT(Oct_Val,\"MMMM\"))","v":"OTTOBRE"}]
[null,{"$f":"CHOOSE(1+(WeekStart=\"Monday\"),\"Dom\",\"Lun\",\"Mar\",\"Mer\",\"Gio\",\"Ven\",\"Sab\",\"Dom\")","v":"Lun"},{"$f":"CHOOSE(2+(WeekStart=\"Monday\"),\"Dom\",\"Lun\",\"Mar\",\"Mer\",\"Gio\",\"Ven\",\"Sab\",\"Dom\")","v":"Mar"},{"$f":"CHOOSE(3+(WeekStart=\"Monday\"),\"Dom\",\"Lun\",\"Mar\",\"Mer\",\"Gio\",\"Ven\",\"Sab\",\"Dom\")","v":"Mer"},{"$f":"CHOOSE(4+(WeekStart=\"Monday\"),\"Dom\",\"Lun\",\"Mar\",\"Mer\",\"Gio\",\"Ven\",\"Sab\",\"Dom\")","v":"Gio"},{"$f":"CHOOSE(5+(WeekStart=\"Monday\"),\"Dom\",\"Lun\",\"Mar\",\"Mer\",\"Gio\",\"Ven\",\"Sab\",\"Dom\")","v":"Ven"},{"$f":"CHOOSE(6+(WeekStart=\"Monday\"),\"Dom\",\"Lun\",\"Mar\",\"Mer\",\"Gio\",\"Ven\",\"Sab\",\"Dom\")","v":"Sab"},{"$f":"CHOOSE(7+(WeekStart=\"Monday\"),\"Dom\",\"Lun\",\"Mar\",\"Mer\",\"Gio\",\"Ven\",\"Sab\",\"Dom\")","v":"Dom"},null,{"$f":"CHOOSE(1+(WeekStart=\"Monday\"),\"Dom\",\"Lun\",\"Mar\",\"Mer\",\"Gio\",\"Ven\",\"Sab\",\"Dom\")","v":"Lun"},{"$f":"CHOOSE(2+(WeekStart=\"Monday\"),\"Dom\",\"Lun\",\"Mar\",\"Mer\",\"Gio\",\"Ven\",\"Sab\",\"Dom\")","v":"Mar"},{"$f":"CHOOSE(3+(WeekStart=\"Monday\"),\"Dom\",\"Lun\",\"Mar\",\"Mer\",\"Gio\",\"Ven\",\"Sab\",\"Dom\")","v":"Mer"},{"$f":"CHOOSE(4+(WeekStart=\"Monday\"),\"Dom\",\"Lun\",\"Mar\",\"Mer\",\"Gio\",\"Ven\",\"Sab\",\"Dom\")","v":"Gio"},{"$f":"CHOOSE(5+(WeekStart=\"Monday\"),\"Dom\",\"Lun\",\"Mar\",\"Mer\",\"Gio\",\"Ven\",\"Sab\",\"Dom\")","v":"Ven"},{"$f":"CHOOSE(6+(WeekStart=\"Monday\"),\"Dom\",\"Lun\",\"Mar\",\"Mer\",\"Gio\",\"Ven\",\"Sab\",\"Dom\")","v":"Sab"},{"$f":"CHOOSE(7+(WeekStart=\"Monday\"),\"Dom\",\"Lun\",\"Mar\",\"Mer\",\"Gio\",\"Ven\",\"Sab\",\"Dom\")","v":"Dom"}]
[1,{"$f":"Days+DATE(CalYear,MONTH(Sep_Val),1)-WEEKDAY(DATE(CalYear,MONTH(Sep_Val),1),(WeekStart=\"Monday\")+1)+$A36*7-6","v":"2022-08-29"},"2022-08-30","2022-08-31","2022-09-01","2022-09-02","2022-09-03","2022-09-04",null,{"$f":"Days+DATE(CalYear,MONTH(Oct_Val),1)-WEEKDAY(DATE(CalYear,MONTH(Oct_Val),1),(WeekStart=\"Monday\")+1)+$A36*7-6","v":"2022-09-26"},"2022-09-27","2022-09-28","2022-09-29","2022-09-30","2022-10-01","2022-10-02"]
[2,{"$f":"Days+DATE(CalYear,MONTH(Sep_Val),1)-WEEKDAY(DATE(CalYear,MONTH(Sep_Val),1),(WeekStart=\"Monday\")+1)+$A37*7-6","v":"2022-09-05"},"2022-09-06","2022-09-07","2022-09-08","2022-09-09","2022-09-10","2022-09-11",null,{"$f":"Days+DATE(CalYear,MONTH(Oct_Val),1)-WEEKDAY(DATE(CalYear,MONTH(Oct_Val),1),(WeekStart=\"Monday\")+1)+$A37*7-6","v":"2022-10-03"},"2022-10-04","2022-10-05","2022-10-06","2022-10-07","2022-10-08","2022-10-09"]
[3,{"$f":"Days+DATE(CalYear,MONTH(Sep_Val),1)-WEEKDAY(DATE(CalYear,MONTH(Sep_Val),1),(WeekStart=\"Monday\")+1)+$A38*7-6","v":"2022-09-12"},"2022-09-13","2022-09-14","2022-09-15","2022-09-16","2022-09-17","2022-09-18",null,{"$f":"Days+DATE(CalYear,MONTH(Oct_Val),1)-WEEKDAY(DATE(CalYear,MONTH(Oct_Val),1),(WeekStart=\"Monday\")+1)+$A38*7-6","v":"2022-10-10"},"2022-10-11","2022-10-12","2022-10-13","2022-10-14","2022-10-15","2022-10-16"]
[4,{"$f":"Days+DATE(CalYear,MONTH(Sep_Val),1)-WEEKDAY(DATE(CalYear,MONTH(Sep_Val),1),(WeekStart=\"Monday\")+1)+$A39*7-6","v":"2022-09-19"},"2022-09-20","2022-09-21","2022-09-22","2022-09-23","2022-09-24","2022-09-25",null,{"$f":"Days+DATE(CalYear,MONTH(Oct_Val),1)-WEEKDAY(DATE(CalYear,MONTH(Oct_Val),1),(WeekStart=\"Monday\")+1)+$A39*7-6","v":"2022-10-17"},"2022-10-18","2022-10-19","2022-10-20","2022-10-21","2022-10-22","2022-10-23"]
[5,{"$f":"Days+DATE(CalYear,MONTH(Sep_Val),1)-WEEKDAY(DATE(CalYear,MONTH(Sep_Val),1),(WeekStart=\"Monday\")+1)+$A40*7-6","v":"2022-09-26"},"2022-09-27","2022-09-28","2022-09-29","2022-09-30","2022-10-01","2022-10-02",null,{"$f":"Days+DATE(CalYear,MONTH(Oct_Val),1)-WEEKDAY(DATE(CalYear,MONTH(Oct_Val),1),(WeekStart=\"Monday\")+1)+$A40*7-6","v":"2022-10-24"},"2022-10-25","2022-10-26","2022-10-27","2022-10-28","2022-10-29","2022-10-30"]
[6,{"$f":"Days+DATE(CalYear,MONTH(Sep_Val),1)-WEEKDAY(DATE(CalYear,MONTH(Sep_Val),1),(WeekStart=\"Monday\")+1)+$A41*7-6","v":"2022-10-03"},"2022-10-04","2022-10-05","2022-10-06","2022-10-07","2022-10-08","2022-10-09",null,{"$f":"Days+DATE(CalYear,MONTH(Oct_Val),1)-WEEKDAY(DATE(CalYear,MONTH(Oct_Val),1),(WeekStart=\"Monday\")+1)+$A41*7-6","v":"2022-10-31"},"2022-11-01","2022-11-02","2022-11-03","2022-11-04","2022-11-05","2022-11-06"]
[null,{"$f":"UPPER(TEXT(Nov_Val,\"MMMM\"))","v":"NOVEMBRE"},{"$nulls":7},{"$f":"UPPER(TEXT(Dec_Val,\"MMMM\"))","v":"DICEMBRE"}]
[null,{"$f":"CHOOSE(1+(WeekStart=\"Monday\"),\"Dom\",\"Lun\",\"Mar\",\"Mer\",\"Gio\",\"Ven\",\"Sab\",\"Dom\")","v":"Lun"},{"$f":"CHOOSE(2+(WeekStart=\"Monday\"),\"Dom\",\"Lun\",\"Mar\",\"Mer\",\"Gio\",\"Ven\",\"Sab\",\"Dom\")","v":"Mar"},{"$f":"CHOOSE(3+(WeekStart=\"Monday\"),\"Dom\",\"Lun\",\"Mar\",\"Mer\",\"Gio\",\"Ven\",\"Sab\",\"Dom\")","v":"Mer"},{"$f":"CHOOSE(4+(WeekStart=\"Monday\"),\"Dom\",\"Lun\",\"Mar\",\"Mer\",\"Gio\",\"Ven\",\"Sab\",\"Dom\")","v":"Gio"},{"$f":"CHOOSE(5+(WeekStart=\"Monday\"),\"Dom\",\"Lun\",\"Mar\",\"Mer\",\"Gio\",\"Ven\",\"Sab\",\"Dom\")","v":"Ven"},{"$f":"CHOOSE(6+(WeekStart=\"Monday\"),\"Dom\",\"Lun\",\"Mar\",\"Mer\",\"Gio\",\"Ven\",\"Sab\",\"Dom\")","v":"Sab"},{"$f":"CHOOSE(7+(WeekStart=\"Monday\"),\"Dom\",\"Lun\",\"Mar\",\"Mer\",\"Gio\",\"Ven\",\"Sab\",\"Dom\")","v":"Dom"},null,{"$f":"CHOOSE(1+(WeekStart=\"Monday\"),\"Dom\",\"Lun\",\"Mar\",\"Mer\",\"Gio\",\"Ven\",\"Sab\",\"Dom\")","v":"Lun"},{"$f":"CHOOSE(2+(WeekStart=\"Monday\"),\"Dom\",\"Lun\",\"Mar\",\"Mer\",\"Gio\",\"Ven\",\"Sab\",\"Dom\")","v":"Mar"},{"$f":"CHOOSE(3+(WeekStart=\"Monday\"),\"Dom\",\"Lun\",\"Mar\",\"Mer\",\"Gio\",\"Ven\",\"Sab\",\"Dom\")","v":"Mer"},{"$f":"CHOOSE(4+(WeekStart=\"Monday\"),\"Dom\",\"Lun\",\"Mar\",\"Mer\",\"Gio\",\"Ven\",\"Sab\",\"Dom\")","v":"Gio"},{"$f":"CHOOSE(5+(WeekStart=\"Monday\"),\"Dom\",\"Lun\",\"Mar\",\"Mer\",\"Gio\",\"Ven\",\"Sab\",\"Dom\")","v":"Ven"},{"$f":"CHOOSE(6+(WeekStart=\"Monday\"),\"Dom\",\"Lun\",\"Mar\",\"Mer\",\"Gio\",\"Ven\",\"Sab\",\"Dom\")","v":"Sab"},{"$f":"CHOOSE(7+(WeekStart=\"Monday\"),\"Dom\",\"Lun\",\"Mar\",\"Mer\",\"Gio\",\"Ven\",\"Sab\",\"Dom\")","v":"Dom"}]
[null,{"$f":"Days+DATE(CalYear,MONTH(Nov_Val),1)-WEEKDAY(DATE(CalYear,MONTH(Nov_Val),1),(WeekStart=\"Monday\")+1)+$A36*7-6","v":"2022-10-31"},"2022-11-01","2022-11-02","2022-11-03","2022-11-04","2022-11-05","2022-11-06",null,{"$f":"Days+DATE(CalYear,MONTH(Dec_Val),1)-WEEKDAY(DATE(CalYear,MONTH(Dec_Val),1),(WeekStart=\"Monday\")+1)+$A36*7-6","v":"2022-11-28"},"2022-11-29","2022-11-30","2022-12-01","2022-12-02","2022-12-03","2022-12-04"]
[null,{"$f":"Days+DATE(CalYear,MONTH(Nov_Val),1)-WEEKDAY(DATE(CalYear,MONTH(Nov_Val),1),(WeekStart=\"Monday\")+1)+$A37*7-6","v":"2022-11-07"},"2022-11-08","2022-11-09","2022-11-10","2022-11-11","2022-11-12","2022-11-13",null,{"$f":"Days+DATE(CalYear,MONTH(Dec_Val),1)-WEEKDAY(DATE(CalYear,MONTH(Dec_Val),1),(WeekStart=\"Monday\")+1)+$A37*7-6","v":"2022-12-05"},"2022-12-06","2022-12-07","2022-12-08","2022-12-09","2022-12-10","2022-12-11"]
[null,{"$f":"Days+DATE(CalYear,MONTH(Nov_Val),1)-WEEKDAY(DATE(CalYear,MONTH(Nov_Val),1),(WeekStart=\"Monday\")+1)+$A38*7-6","v":"2022-11-14"},"2022-11-15","2022-11-16","2022-11-17","2022-11-18","2022-11-19","2022-11-20",null,{"$f":"Days+DATE(CalYear,MONTH(Dec_Val),1)-WEEKDAY(DATE(CalYear,MONTH(Dec_Val),1),(WeekStart=\"Monday\")+1)+$A38*7-6","v":"2022-12-12"},"2022-12-13","2022-12-14","2022-12-15","2022-12-16","2022-12-17","2022-12-18"]
[null,{"$f":"Days+DATE(CalYear,MONTH(Nov_Val),1)-WEEKDAY(DATE(CalYear,MONTH(Nov_Val),1),(WeekStart=\"Monday\")+1)+$A39*7-6","v":"2022-11-21"},"2022-11-22","2022-11-23","2022-11-24","2022-11-25","2022-11-26","2022-11-27",null,{"$f":"Days+DATE(CalYear,MONTH(Dec_Val),1)-WEEKDAY(DATE(CalYear,MONTH(Dec_Val),1),(WeekStart=\"Monday\")+1)+$A39*7-6","v":"2022-12-19"},"2022-12-20","2022-12-21","2022-12-22","2022-12-23","2022-12-24","2022-12-25"]
[null,{"$f":"Days+DATE(CalYear,MONTH(Nov_Val),1)-WEEKDAY(DATE(CalYear,MONTH(Nov_Val),1),(WeekStart=\"Monday\")+1)+$A40*7-6","v":"2022-11-28"},"2022-11-29","2022-11-30","2022-12-01","2022-12-02","2022-12-03","2022-12-04",null,{"$f":"Days+DATE(CalYear,MONTH(Dec_Val),1)-WEEKDAY(DATE(CalYear,MONTH(Dec_Val),1),(WeekStart=\"Monday\")+1)+$A40*7-6","v":"2022-12-26"},"2022-12-27","2022-12-28","2022-12-29","2022-12-30","2022-12-31","2023-01-01"]
[null,{"$f":"Days+DATE(CalYear,MONTH(Nov_Val),1)-WEEKDAY(DATE(CalYear,MONTH(Nov_Val),1),(WeekStart=\"Monday\")+1)+$A41*7-6","v":"2022-12-05"},"2022-12-06","2022-12-07","2022-12-08","2022-12-09","2022-12-10","2022-12-11",null,{"$f":"Days+DATE(CalYear,MONTH(Dec_Val),1)-WEEKDAY(DATE(CalYear,MONTH(Dec_Val),1),(WeekStart=\"Monday\")+1)+$A41*7-6","v":"2023-01-02"},"2023-01-03","2023-01-04","2023-01-05","2023-01-06","2023-01-07","2023-01-08"]